BDBM50299090 2-[3-(3-Methoxyphenyl)-1-benzofuran-5-yl]-5-methyl-1,3,4-oxadiazole::CHEMBL573486
SMILES: COc1cccc(c1)-c1coc2ccc(cc12)-c1ccc(C)o1
InChI Key: InChIKey=ZWCVZZNMBKGJEJ-UHFFFAOYSA-N
Data: 1 IC50
Activity Spreadsheet -- Enzyme Inhibition Constant Data from BindingDB
Found 1 hit for monomerid = 50299090
Trg + Lig
Ki
nM
ΔG°
kcal/mole
IC50
nM
Kd
nM
EC50/IC50
nM
koff
s-1
kon
M-1s-1
pHTemp
°C
Glycogen synthase kinase-3 beta
(Homo sapiens (Human))
BDBM50299090
(2-[3-(3-Methoxyphenyl)-1-benzofuran-5-yl]-5-methyl...)
Show SMILES COc1cccc(c1)-c1coc2ccc(cc12)-c1ccc(C)o1
Show InChI InChI=1S/C20H16O3/c1-13-6-8-19(23-13)15-7-9-20-17(11-15)18(12-22-20)14-4-3-5-16(10-14)21-2/h3-12H,1-2H3
NCI pathway
Reactome pathway
n/an/a 74n/an/an/an/an/an/a
Takeda Pharmaceutical Company, Ltd.
Curated by ChEMBL
Assay Description
Inhibition of human recombinant GSK3-beta
J Med Chem 52: 6270-86 (2009)
Article DOI: 10.1021/jm900647e
BindingDB Entry DOI: 10.7270/Q2CZ377V