BDBM50299093 2-[3-(4-Fluorophenyl)-1-benzofuran-5-yl]-5-methyl-1,3,4-oxadiazol::CHEMBL573007
SMILES: Cc1ccc(o1)-c1ccc2occ(-c3ccc(F)cc3)c2c1
InChI Key: InChIKey=QRSFTXAQTCFHKT-UHFFFAOYSA-N
Data: 1 IC50
Activity Spreadsheet -- Enzyme Inhibition Constant Data from BindingDB
Found 1 hit for monomerid = 50299093
Trg + Lig
Ki
nM
ΔG°
kcal/mole
IC50
nM
Kd
nM
EC50/IC50
nM
koff
s-1
kon
M-1s-1
pHTemp
°C
Glycogen synthase kinase-3 beta
(Homo sapiens (Human))
BDBM50299093
(2-[3-(4-Fluorophenyl)-1-benzofuran-5-yl]-5-methyl-...)
Show SMILES Cc1ccc(o1)-c1ccc2occ(-c3ccc(F)cc3)c2c1
Show InChI InChI=1S/C19H13FO2/c1-12-2-8-18(22-12)14-5-9-19-16(10-14)17(11-21-19)13-3-6-15(20)7-4-13/h2-11H,1H3
NCI pathway
Reactome pathway
n/an/a 110n/an/an/an/an/an/a
Takeda Pharmaceutical Company, Ltd.
Curated by ChEMBL
Assay Description
Inhibition of human recombinant GSK3-beta
J Med Chem 52: 6270-86 (2009)
Article DOI: 10.1021/jm900647e
BindingDB Entry DOI: 10.7270/Q2CZ377V