BDBM50299446 7-(Benzyloxy)-4-[(methylamino)methyl]-2H-chromen-2-one::CHEMBL573052
SMILES: CNCc1cc(=O)oc2cc(OCc3ccccc3)ccc12
InChI Key: InChIKey=ULGCVCJWEFBDKS-UHFFFAOYSA-N
Data: 2 IC50
Activity Spreadsheet -- Enzyme Inhibition Constant Data from BindingDB
Found 2 hits for monomerid = 50299446
Trg + Lig
Ki
nM
ΔG°
kcal/mole
IC50
nM
Kd
nM
EC50/IC50
nM
koff
s-1
kon
M-1s-1
pHTemp
°C
Monoamine Oxidase Type B (MAO-B)
(Rattus norvegicus (rat))
BDBM50299446
(7-(Benzyloxy)-4-[(methylamino)methyl]-2H-chromen-2...)
Show SMILES CNCc1cc(=O)oc2cc(OCc3ccccc3)ccc12
Show InChI InChI=1S/C18H17NO3/c1-19-11-14-9-18(20)22-17-10-15(7-8-16(14)17)21-12-13-5-3-2-4-6-13/h2-10,19H,11-12H2,1H3
n/an/a 28n/an/an/an/an/an/a
Universita degli Studi di Bari
Curated by ChEMBL
Assay Description
Inhibition of MAO-B from Wistar rat brain by radioenzymatic assay
J Med Chem 52: 6685-706 (2009)
Article DOI: 10.1021/jm9010127
BindingDB Entry DOI: 10.7270/Q2DR2VJ6
Monoamine oxidase
(Rattus norvegicus (rat))
BDBM50299446
(7-(Benzyloxy)-4-[(methylamino)methyl]-2H-chromen-2...)
Show SMILES CNCc1cc(=O)oc2cc(OCc3ccccc3)ccc12
Show InChI InChI=1S/C18H17NO3/c1-19-11-14-9-18(20)22-17-10-15(7-8-16(14)17)21-12-13-5-3-2-4-6-13/h2-10,19H,11-12H2,1H3
n/an/a 1.54E+4n/an/an/an/an/an/a
Universita degli Studi di Bari
Curated by ChEMBL
Assay Description
Inhibition of MAO-A from Wistar rat brain by radioenzymatic assay
J Med Chem 52: 6685-706 (2009)
Article DOI: 10.1021/jm9010127
BindingDB Entry DOI: 10.7270/Q2DR2VJ6