BDBM50299448 4-[(Ethylamino)methyl]-7-[(3-fluorobenzyl)oxy]-2H-chromen-2-one Methanesulfonate::CHEMBL575734
SMILES: CCNCc1cc(=O)oc2cc(OCc3cccc(F)c3)ccc12
InChI Key: InChIKey=PPAYECJLTZWNMN-UHFFFAOYSA-N
Data: 2 IC50
Activity Spreadsheet -- Enzyme Inhibition Constant Data from BindingDB
Found 2 hits for monomerid = 50299448
Trg + Lig
Ki
nM
ΔG°
kcal/mole
IC50
nM
Kd
nM
EC50/IC50
nM
koff
s-1
kon
M-1s-1
pHTemp
°C
Monoamine Oxidase Type B (MAO-B)
(Rattus norvegicus (rat))
BDBM50299448
(4-[(Ethylamino)methyl]-7-[(3-fluorobenzyl)oxy]-2H-...)
Show SMILES CCNCc1cc(=O)oc2cc(OCc3cccc(F)c3)ccc12
Show InChI InChI=1S/C19H18FNO3/c1-2-21-11-14-9-19(22)24-18-10-16(6-7-17(14)18)23-12-13-4-3-5-15(20)8-13/h3-10,21H,2,11-12H2,1H3
n/an/a 100n/an/an/an/an/an/a
Universita degli Studi di Bari
Curated by ChEMBL
Assay Description
Inhibition of MAO-B from Wistar rat brain by radioenzymatic assay
J Med Chem 52: 6685-706 (2009)
Article DOI: 10.1021/jm9010127
BindingDB Entry DOI: 10.7270/Q2DR2VJ6
Monoamine oxidase
(Rattus norvegicus (rat))
BDBM50299448
(4-[(Ethylamino)methyl]-7-[(3-fluorobenzyl)oxy]-2H-...)
Show SMILES CCNCc1cc(=O)oc2cc(OCc3cccc(F)c3)ccc12
Show InChI InChI=1S/C19H18FNO3/c1-2-21-11-14-9-19(22)24-18-10-16(6-7-17(14)18)23-12-13-4-3-5-15(20)8-13/h3-10,21H,2,11-12H2,1H3
n/an/a 2.26E+4n/an/an/an/an/an/a
Universita degli Studi di Bari
Curated by ChEMBL
Assay Description
Inhibition of MAO-A from Wistar rat brain by radioenzymatic assay
J Med Chem 52: 6685-706 (2009)
Article DOI: 10.1021/jm9010127
BindingDB Entry DOI: 10.7270/Q2DR2VJ6