BDBM50299455 7-[(3-Chlorobenzyl)oxy]-4-[2-(methylamino)ethyl]-2H-chromen-2-one::CHEMBL573988
SMILES: CNCCc1cc(=O)oc2cc(OCc3cccc(Cl)c3)ccc12
InChI Key: InChIKey=OOLOFDOIHIHOPL-UHFFFAOYSA-N
Data: 2 IC50
Activity Spreadsheet -- Enzyme Inhibition Constant Data from BindingDB
Found 2 hits for monomerid = 50299455
Trg + Lig
Ki
nM
ΔG°
kcal/mole
IC50
nM
Kd
nM
EC50/IC50
nM
koff
s-1
kon
M-1s-1
pHTemp
°C
Monoamine Oxidase Type B (MAO-B)
(Rattus norvegicus (rat))
BDBM50299455
(7-[(3-Chlorobenzyl)oxy]-4-[2-(methylamino)ethyl]-2...)
Show SMILES CNCCc1cc(=O)oc2cc(OCc3cccc(Cl)c3)ccc12
Show InChI InChI=1S/C19H18ClNO3/c1-21-8-7-14-10-19(22)24-18-11-16(5-6-17(14)18)23-12-13-3-2-4-15(20)9-13/h2-6,9-11,21H,7-8,12H2,1H3
n/an/a 300n/an/an/an/an/an/a
Universita degli Studi di Bari
Curated by ChEMBL
Assay Description
Inhibition of MAO-B from Wistar rat brain by radioenzymatic assay
J Med Chem 52: 6685-706 (2009)
Article DOI: 10.1021/jm9010127
BindingDB Entry DOI: 10.7270/Q2DR2VJ6
Monoamine oxidase
(Rattus norvegicus (rat))
BDBM50299455
(7-[(3-Chlorobenzyl)oxy]-4-[2-(methylamino)ethyl]-2...)
Show SMILES CNCCc1cc(=O)oc2cc(OCc3cccc(Cl)c3)ccc12
Show InChI InChI=1S/C19H18ClNO3/c1-21-8-7-14-10-19(22)24-18-11-16(5-6-17(14)18)23-12-13-3-2-4-15(20)9-13/h2-6,9-11,21H,7-8,12H2,1H3
n/an/a 7.40E+4n/an/an/an/an/an/a
Universita degli Studi di Bari
Curated by ChEMBL
Assay Description
Inhibition of MAO-A from Wistar rat brain by radioenzymatic assay
J Med Chem 52: 6685-706 (2009)
Article DOI: 10.1021/jm9010127
BindingDB Entry DOI: 10.7270/Q2DR2VJ6