BDBM50299456 CHEMBL584377::N2-[7-(Benzyloxy)-2-oxo-2H-chromen-4-yl]alaninamide
SMILES: C[C@H](Nc1cc(=O)oc2cc(OCc3ccccc3)ccc12)C(N)=O
InChI Key: InChIKey=OIFORSBJXPMZAX-LBPRGKRZSA-N
Data: 2 IC50
Activity Spreadsheet -- Enzyme Inhibition Constant Data from BindingDB
Found 2 hits for monomerid = 50299456
Trg + Lig
Ki
nM
ΔG°
kcal/mole
IC50
nM
Kd
nM
EC50/IC50
nM
koff
s-1
kon
M-1s-1
pHTemp
°C
Amine oxidase [flavin-containing] B
(Rattus norvegicus (rat))
BDBM50299456
(CHEMBL584377 | N2-[7-(Benzyloxy)-2-oxo-2H-chromen-...)
Show SMILES C[C@H](Nc1cc(=O)oc2cc(OCc3ccccc3)ccc12)C(N)=O |r|
Show InChI InChI=1S/C19H18N2O4/c1-12(19(20)23)21-16-10-18(22)25-17-9-14(7-8-15(16)17)24-11-13-5-3-2-4-6-13/h2-10,12,21H,11H2,1H3,(H2,20,23)/t12-/m0/s1
n/an/a 680n/an/an/an/an/an/a
Universita degli Studi di Bari
Curated by ChEMBL
Assay Description
Inhibition of MAO-B from Wistar rat brain by radioenzymatic assay
J Med Chem 52: 6685-706 (2009)
Article DOI: 10.1021/jm9010127
BindingDB Entry DOI: 10.7270/Q2DR2VJ6
Amine oxidase [flavin-containing] A
(Rattus norvegicus (rat))
BDBM50299456
(CHEMBL584377 | N2-[7-(Benzyloxy)-2-oxo-2H-chromen-...)
Show SMILES C[C@H](Nc1cc(=O)oc2cc(OCc3ccccc3)ccc12)C(N)=O |r|
Show InChI InChI=1S/C19H18N2O4/c1-12(19(20)23)21-16-10-18(22)25-17-9-14(7-8-15(16)17)24-11-13-5-3-2-4-6-13/h2-10,12,21H,11H2,1H3,(H2,20,23)/t12-/m0/s1
n/an/a 1.00E+5n/an/an/an/an/an/a
Universita degli Studi di Bari
Curated by ChEMBL
Assay Description
Inhibition of MAO-A from Wistar rat brain by radioenzymatic assay
J Med Chem 52: 6685-706 (2009)
Article DOI: 10.1021/jm9010127
BindingDB Entry DOI: 10.7270/Q2DR2VJ6