BDBM50299459 (7-Benzyloxy-2-oxo-2H-chromen-4-yl)acetonitrile::CHEMBL572768
SMILES: O=c1cc(CC#N)c2ccc(OCc3ccccc3)cc2o1
InChI Key: InChIKey=QXYWJHCXXQZBTQ-UHFFFAOYSA-N
Data: 2 IC50
Activity Spreadsheet -- Enzyme Inhibition Constant Data from BindingDB
Found 2 hits for monomerid = 50299459
Trg + Lig
Ki
nM
ΔG°
kcal/mole
IC50
nM
Kd
nM
EC50/IC50
nM
koff
s-1
kon
M-1s-1
pHTemp
°C
Monoamine Oxidase Type B (MAO-B)
(Rattus norvegicus (rat))
BDBM50299459
((7-Benzyloxy-2-oxo-2H-chromen-4-yl)acetonitrile | ...)
Show SMILES O=c1cc(CC#N)c2ccc(OCc3ccccc3)cc2o1
Show InChI InChI=1S/C18H13NO3/c19-9-8-14-10-18(20)22-17-11-15(6-7-16(14)17)21-12-13-4-2-1-3-5-13/h1-7,10-11H,8,12H2
n/an/a 230n/an/an/an/an/an/a
Universita degli Studi di Bari
Curated by ChEMBL
Assay Description
Inhibition of MAO-B from Wistar rat brain by radioenzymatic assay
J Med Chem 52: 6685-706 (2009)
Article DOI: 10.1021/jm9010127
BindingDB Entry DOI: 10.7270/Q2DR2VJ6
Monoamine oxidase
(Rattus norvegicus (rat))
BDBM50299459
((7-Benzyloxy-2-oxo-2H-chromen-4-yl)acetonitrile | ...)
Show SMILES O=c1cc(CC#N)c2ccc(OCc3ccccc3)cc2o1
Show InChI InChI=1S/C18H13NO3/c19-9-8-14-10-18(20)22-17-11-15(6-7-16(14)17)21-12-13-4-2-1-3-5-13/h1-7,10-11H,8,12H2
n/an/a 200n/an/an/an/an/an/a
Universita degli Studi di Bari
Curated by ChEMBL
Assay Description
Inhibition of MAO-A from Wistar rat brain by radioenzymatic assay
J Med Chem 52: 6685-706 (2009)
Article DOI: 10.1021/jm9010127
BindingDB Entry DOI: 10.7270/Q2DR2VJ6