null
SMILES: C[C@@H](NCc1nc(cs1)-c1ccccc1)c1ccccc1
InChI Key: InChIKey=KOSIXKJFIVAAFS-CQSZACIVSA-N
Activity Spreadsheet -- Enzyme Inhibition Constant Data from BindingDB
Found 1 hit for monomerid = 50299674
Trg + Lig
Ki
nM
ΔG°
kcal/mole
IC50
nM
Kd
nM
EC50/IC50
nM
koff
s-1
kon
M-1s-1
pHTemp
°C
Extracellular calcium-sensing receptor
(Homo sapiens (Human))
BDBM50299674
((R)-1-phenyl-N-((4-phenyl-1,3-thiazol-2-yl)methyl)...)
Show SMILES C[C@@H](NCc1nc(cs1)-c1ccccc1)c1ccccc1 |r|
Show InChI InChI=1S/C18H18N2S/c1-14(15-8-4-2-5-9-15)19-12-18-20-17(13-21-18)16-10-6-3-7-11-16/h2-11,13-14,19H,12H2,1H3/t14-/m1/s1
n/an/an/an/a>5.00E+3n/an/an/an/a
Amgen Inc.
Curated by ChEMBL
Assay Description
Activity at human CaSR expressed in HEK293 cells assessed as calcium release by FLIPR assay
J Med Chem 52: 6535-8 (2009)
Article DOI: 10.1021/jm9012278
BindingDB Entry DOI: 10.7270/Q28052PS