null
SMILES: COc1cc(nn1-c1ccc(Br)cc1)[C@@H](C)N[C@H](C)c1cccc(Cl)c1
InChI Key: InChIKey=FJXHQJTYKKPMGO-ZIAGYGMSSA-N
Activity Spreadsheet -- Enzyme Inhibition Constant Data from BindingDB
Found 1 hit for monomerid = 50299683
Trg + Lig
Ki
nM
ΔG°
kcal/mole
IC50
nM
Kd
nM
EC50/IC50
nM
koff
s-1
kon
M-1s-1
pHTemp
°C
Extracellular calcium-sensing receptor
(Homo sapiens (Human))
BDBM50299683
(1(R)-1-(1-(4-bromophenyl)-5-methoxy-1H-pyrazol-3-y...)
Show SMILES COc1cc(nn1-c1ccc(Br)cc1)[C@@H](C)N[C@H](C)c1cccc(Cl)c1 |r|
Show InChI InChI=1S/C20H21BrClN3O/c1-13(15-5-4-6-17(22)11-15)23-14(2)19-12-20(26-3)25(24-19)18-9-7-16(21)8-10-18/h4-14,23H,1-3H3/t13-,14-/m1/s1
n/an/an/an/a 23n/an/an/an/a
Amgen Inc.
Curated by ChEMBL
Assay Description
Activity at human CaSR expressed in HEK293 cells assessed as calcium release by FLIPR assay
J Med Chem 52: 6535-8 (2009)
Article DOI: 10.1021/jm9012278
BindingDB Entry DOI: 10.7270/Q28052PS