BDBM50299792 4-(3-fluoro-2-phenoxyphenyl)piperidine::CHEMBL583751
SMILES: Fc1cccc(C2CCNCC2)c1Oc1ccccc1
InChI Key: InChIKey=WWIFVPBPYYVHTD-UHFFFAOYSA-N
Data: 4 KI  4 EC50
Activity Spreadsheet -- Enzyme Inhibition Constant Data from BindingDB
Found 8 hits for monomerid = 50299792
Trg + Lig
Ki
nM
ΔG°
kcal/mole
IC50
nM
Kd
nM
EC50/IC50
nM
koff
s-1
kon
M-1s-1
pHTemp
°C
5-hydroxytryptamine receptor 1A
(Homo sapiens (Human))
BDBM50299792
(4-(3-fluoro-2-phenoxyphenyl)piperidine | CHEMBL583...)
Show SMILES Fc1cccc(C2CCNCC2)c1Oc1ccccc1
Show InChI InChI=1S/C17H18FNO/c18-16-8-4-7-15(13-9-11-19-12-10-13)17(16)20-14-5-2-1-3-6-14/h1-8,13,19H,9-12H2
20n/an/an/an/an/an/an/an/a
Pfizer Global Research and Development
Curated by ChEMBL
Assay Description
Displacement of [3H]8-OH-DPAT from human 5HT1A receptor expressed in CHO cells
Bioorg Med Chem Lett 19: 6604-7 (2009)
Article DOI: 10.1016/j.bmcl.2009.10.014
BindingDB Entry DOI: 10.7270/Q23B606Z
Sodium-dependent dopamine transporter
(Homo sapiens (Human))
BDBM50299792
(4-(3-fluoro-2-phenoxyphenyl)piperidine | CHEMBL583...)
Show SMILES Fc1cccc(C2CCNCC2)c1Oc1ccccc1
Show InChI InChI=1S/C17H18FNO/c18-16-8-4-7-15(13-9-11-19-12-10-13)17(16)20-14-5-2-1-3-6-14/h1-8,13,19H,9-12H2
NCI pathway
Reactome pathway
239n/an/an/an/an/an/an/an/a
Pfizer Global Research and Development
Curated by ChEMBL
Assay Description
Displacement of [125I]RTI-55 from human DAT expressed in HEK293 cells
Bioorg Med Chem Lett 19: 6604-7 (2009)
Article DOI: 10.1016/j.bmcl.2009.10.014
BindingDB Entry DOI: 10.7270/Q23B606Z
Sodium-dependent noradrenaline transporter
(Homo sapiens (Human))
BDBM50299792
(4-(3-fluoro-2-phenoxyphenyl)piperidine | CHEMBL583...)
Show SMILES Fc1cccc(C2CCNCC2)c1Oc1ccccc1
Show InChI InChI=1S/C17H18FNO/c18-16-8-4-7-15(13-9-11-19-12-10-13)17(16)20-14-5-2-1-3-6-14/h1-8,13,19H,9-12H2
Reactome pathway
1.37E+3n/an/an/an/an/an/an/an/a
Pfizer Global Research and Development
Curated by ChEMBL
Assay Description
Displacement of [125I]RTI-55 from human NET expressed in HEK293 cells
Bioorg Med Chem Lett 19: 6604-7 (2009)
Article DOI: 10.1016/j.bmcl.2009.10.014
BindingDB Entry DOI: 10.7270/Q23B606Z
Sodium-dependent serotonin transporter
(Homo sapiens (Human))
BDBM50299792
(4-(3-fluoro-2-phenoxyphenyl)piperidine | CHEMBL583...)
Show SMILES Fc1cccc(C2CCNCC2)c1Oc1ccccc1
Show InChI InChI=1S/C17H18FNO/c18-16-8-4-7-15(13-9-11-19-12-10-13)17(16)20-14-5-2-1-3-6-14/h1-8,13,19H,9-12H2
2.33E+3n/an/an/an/an/an/an/an/a
Pfizer Global Research and Development
Curated by ChEMBL
Assay Description
Displacement of [125I]RTI-55 from human SERT expressed in HEK293 cells
Bioorg Med Chem Lett 19: 6604-7 (2009)
Article DOI: 10.1016/j.bmcl.2009.10.014
BindingDB Entry DOI: 10.7270/Q23B606Z
5-hydroxytryptamine receptor 1A
(Homo sapiens (Human))
BDBM50299792
(4-(3-fluoro-2-phenoxyphenyl)piperidine | CHEMBL583...)
Show SMILES Fc1cccc(C2CCNCC2)c1Oc1ccccc1
Show InChI InChI=1S/C17H18FNO/c18-16-8-4-7-15(13-9-11-19-12-10-13)17(16)20-14-5-2-1-3-6-14/h1-8,13,19H,9-12H2
n/an/an/an/a 877n/an/an/an/a
Pfizer Global Research and Development
Curated by ChEMBL
Assay Description
Partial agonist activity at human 5HT1A expressed in HEK293 cells by FLIPR assay
Bioorg Med Chem Lett 19: 6604-7 (2009)
Article DOI: 10.1016/j.bmcl.2009.10.014
BindingDB Entry DOI: 10.7270/Q23B606Z
Sodium-dependent noradrenaline transporter
(Homo sapiens (Human))
BDBM50299792
(4-(3-fluoro-2-phenoxyphenyl)piperidine | CHEMBL583...)
Show SMILES Fc1cccc(C2CCNCC2)c1Oc1ccccc1
Show InChI InChI=1S/C17H18FNO/c18-16-8-4-7-15(13-9-11-19-12-10-13)17(16)20-14-5-2-1-3-6-14/h1-8,13,19H,9-12H2
Reactome pathway
n/an/an/an/a 358n/an/an/an/a
Pfizer Global Research and Development
Curated by ChEMBL
Assay Description
Inhibition of norepinephrine uptake at human NET expressed in HEK293 cells
Bioorg Med Chem Lett 19: 6604-7 (2009)
Article DOI: 10.1016/j.bmcl.2009.10.014
BindingDB Entry DOI: 10.7270/Q23B606Z
Sodium-dependent serotonin transporter
(Homo sapiens (Human))
BDBM50299792
(4-(3-fluoro-2-phenoxyphenyl)piperidine | CHEMBL583...)
Show SMILES Fc1cccc(C2CCNCC2)c1Oc1ccccc1
Show InChI InChI=1S/C17H18FNO/c18-16-8-4-7-15(13-9-11-19-12-10-13)17(16)20-14-5-2-1-3-6-14/h1-8,13,19H,9-12H2
n/an/an/an/a 1.76E+3n/an/an/an/a
Pfizer Global Research and Development
Curated by ChEMBL
Assay Description
Inhibition of [3H]5-HT uptake at human 5HTT expressed in HEK293 cells
Bioorg Med Chem Lett 19: 6604-7 (2009)
Article DOI: 10.1016/j.bmcl.2009.10.014
BindingDB Entry DOI: 10.7270/Q23B606Z
Sodium-dependent dopamine transporter
(Homo sapiens (Human))
BDBM50299792
(4-(3-fluoro-2-phenoxyphenyl)piperidine | CHEMBL583...)
Show SMILES Fc1cccc(C2CCNCC2)c1Oc1ccccc1
Show InChI InChI=1S/C17H18FNO/c18-16-8-4-7-15(13-9-11-19-12-10-13)17(16)20-14-5-2-1-3-6-14/h1-8,13,19H,9-12H2
NCI pathway
Reactome pathway
n/an/an/an/a 982n/an/an/an/a
Pfizer Global Research and Development
Curated by ChEMBL
Assay Description
Inhibition of dopamine uptake at human DAT expressed in HEK293 cells
Bioorg Med Chem Lett 19: 6604-7 (2009)
Article DOI: 10.1016/j.bmcl.2009.10.014
BindingDB Entry DOI: 10.7270/Q23B606Z