BDBM50300011 2-(4-(5-Thioxo-4,5-dihydro-1,2,4-oxadiazol-3-yl)phenyl)-1Hbenzo[d]imidazole-4-carboxamide::CHEMBL569636
SMILES: NC(=O)c1cccc2[nH]c(nc12)-c1ccc(cc1)-c1nc(=S)o[nH]1
InChI Key: InChIKey=RCROQKUWCBPYHE-UHFFFAOYSA-N
Data: 1 KI  1 EC50
Activity Spreadsheet -- Enzyme Inhibition Constant Data from BindingDB
Found 2 hits for monomerid = 50300011
Trg + Lig
Ki
nM
ΔG°
kcal/mole
IC50
nM
Kd
nM
EC50/IC50
nM
koff
s-1
kon
M-1s-1
pHTemp
°C
Poly [ADP-ribose] polymerase 1
(Homo sapiens (Human))
BDBM50300011
(2-(4-(5-Thioxo-4,5-dihydro-1,2,4-oxadiazol-3-yl)ph...)
Show SMILES NC(=O)c1cccc2[nH]c(nc12)-c1ccc(cc1)-c1nc(=S)o[nH]1
Show InChI InChI=1S/C16H11N5O2S/c17-13(22)10-2-1-3-11-12(10)19-14(18-11)8-4-6-9(7-5-8)15-20-16(24)23-21-15/h1-7H,(H2,17,22)(H,18,19)(H,20,21,24)
3.80n/an/an/an/an/an/an/an/a
Abbott Laboratories
Curated by ChEMBL
Assay Description
Inhibition of PARP1 by scintillation counting
J Med Chem 52: 6803-13 (2009)
Article DOI: 10.1021/jm900697r
BindingDB Entry DOI: 10.7270/Q2DN4548
Poly [ADP-ribose] polymerase 1
(Homo sapiens (Human))
BDBM50300011
(2-(4-(5-Thioxo-4,5-dihydro-1,2,4-oxadiazol-3-yl)ph...)
Show SMILES NC(=O)c1cccc2[nH]c(nc12)-c1ccc(cc1)-c1nc(=S)o[nH]1
Show InChI InChI=1S/C16H11N5O2S/c17-13(22)10-2-1-3-11-12(10)19-14(18-11)8-4-6-9(7-5-8)15-20-16(24)23-21-15/h1-7H,(H2,17,22)(H,18,19)(H,20,21,24)
n/an/an/an/a 328n/an/an/an/a
Abbott Laboratories
Curated by ChEMBL
Assay Description
Inhibition of PARP1 in human C41 cells after 30 mins by cell-based assay
J Med Chem 52: 6803-13 (2009)
Article DOI: 10.1021/jm900697r
BindingDB Entry DOI: 10.7270/Q2DN4548