BDBM50300134 (S)-5-Chloro-1-(1-cyclopropyl-2-methoxyethyl)-3-(6-methoxy-2,5-dimethylpyridin-3-ylamino)pyrazin-2(1H)-one::CHEMBL574436
SMILES: COC[C@H](C1CC1)n1cc(Cl)nc(Nc2cc(C)c(OC)nc2C)c1=O
InChI Key: InChIKey=WHAZSYWKCSEYRK-CQSZACIVSA-N
Data: 2 IC50
Activity Spreadsheet -- Enzyme Inhibition Constant Data from BindingDB
Found 2 hits for monomerid = 50300134
Trg + Lig
Ki
nM
ΔG°
kcal/mole
IC50
nM
Kd
nM
EC50/IC50
nM
koff
s-1
kon
M-1s-1
pHTemp
°C
Corticotropin releasing factor receptor
(Rattus norvegicus (rat))
BDBM50300134
((S)-5-Chloro-1-(1-cyclopropyl-2-methoxyethyl)-3-(6...)
Show SMILES COC[C@H](C1CC1)n1cc(Cl)nc(Nc2cc(C)c(OC)nc2C)c1=O |r|
Show InChI InChI=1S/C18H23ClN4O3/c1-10-7-13(11(2)20-17(10)26-4)21-16-18(24)23(8-15(19)22-16)14(9-25-3)12-5-6-12/h7-8,12,14H,5-6,9H2,1-4H3,(H,21,22)/t14-/m1/s1
Reactome pathway
n/an/a 1.5n/an/an/an/an/an/a
Bristol-Myers Squibb Co.
Curated by ChEMBL
Assay Description
Displacement of [125I]Tyr-ovine-CRF from CRF1 receptor in rat frontal cortex homogenate after 2 hrs by gamma counting analysis
Bioorg Med Chem Lett 26: 2184-7 (2016)
Article DOI: 10.1016/j.bmcl.2016.03.067
BindingDB Entry DOI: 10.7270/Q2KK9FVR
Corticotropin releasing factor receptor
(Rattus norvegicus (rat))
BDBM50300134
((S)-5-Chloro-1-(1-cyclopropyl-2-methoxyethyl)-3-(6...)
Show SMILES COC[C@H](C1CC1)n1cc(Cl)nc(Nc2cc(C)c(OC)nc2C)c1=O |r|
Show InChI InChI=1S/C18H23ClN4O3/c1-10-7-13(11(2)20-17(10)26-4)21-16-18(24)23(8-15(19)22-16)14(9-25-3)12-5-6-12/h7-8,12,14H,5-6,9H2,1-4H3,(H,21,22)/t14-/m1/s1
Reactome pathway
n/an/a 1.5n/an/an/an/an/an/a
Bristol-Myers Squibb Company
Curated by ChEMBL
Assay Description
Displacement of [125I]Tyr-o-CRF from CRF1 receptor in rat frontal cortex homogenate by binding titration assay
J Med Chem 52: 7653-68 (2009)
Article DOI: 10.1021/jm900716v
BindingDB Entry DOI: 10.7270/Q2CN740W