BDBM50300377 Bis((-)-N-cyclobutylmethylmorphinan-3-yl)2,9-Dimethyldecanedioate::CHEMBL582930
SMILES: CC(CCCCCCC(C)C(=O)Oc1ccc2C[C@@H]3[C@@H]4CCCC[C@]4(CCN3CC3CCC3)c2c1)C(=O)Oc1ccc2C[C@@H]3[C@@H]4CCCC[C@]4(CCN3CC3CCC3)c2c1
InChI Key: InChIKey=BCNHLLUBXGJPDY-YURXEMDDSA-N
Data: 3 KI  1 IC50  2 EC50
Activity Spreadsheet -- Enzyme Inhibition Constant Data from BindingDB
Found 6 hits for monomerid = 50300377
Trg + Lig
Ki
nM
ΔG°
kcal/mole
IC50
nM
Kd
nM
EC50/IC50
nM
koff
s-1
kon
M-1s-1
pHTemp
°C
Kappa-type opioid receptor
(Homo sapiens (Human))
BDBM50300377
(Bis((-)-N-cyclobutylmethylmorphinan-3-yl)2,9-Dimet...)
Show SMILES CC(CCCCCCC(C)C(=O)Oc1ccc2C[C@@H]3[C@@H]4CCCC[C@]4(CCN3CC3CCC3)c2c1)C(=O)Oc1ccc2C[C@@H]3[C@@H]4CCCC[C@]4(CCN3CC3CCC3)c2c1 |r|
Show InChI InChI=1S/C54H76N2O4/c1-37(51(57)59-43-23-21-41-31-49-45-19-7-9-25-53(45,47(41)33-43)27-29-55(49)35-39-15-11-16-39)13-5-3-4-6-14-38(2)52(58)60-44-24-22-42-32-50-46-20-8-10-26-54(46,48(42)34-44)28-30-56(50)36-40-17-12-18-40/h21-24,33-34,37-40,45-46,49-50H,3-20,25-32,35-36H2,1-2H3/t37?,38?,45-,46-,49+,50+,53+,54+/m0/s1
Reactome pathway
0.620n/an/an/an/an/an/an/an/a
Harvard Medical School
Curated by ChEMBL
Assay Description
Displacement of [3H]U69593 from human kappa opioid receptor expressed in CHO cells after 60 mins by liquid scintillation counting
J Med Chem 52: 7389-96 (2009)
Article DOI: 10.1021/jm900379p
BindingDB Entry DOI: 10.7270/Q29P31Q8
Mu-type opioid receptor
(Homo sapiens (Human))
BDBM50300377
(Bis((-)-N-cyclobutylmethylmorphinan-3-yl)2,9-Dimet...)
Show SMILES CC(CCCCCCC(C)C(=O)Oc1ccc2C[C@@H]3[C@@H]4CCCC[C@]4(CCN3CC3CCC3)c2c1)C(=O)Oc1ccc2C[C@@H]3[C@@H]4CCCC[C@]4(CCN3CC3CCC3)c2c1 |r|
Show InChI InChI=1S/C54H76N2O4/c1-37(51(57)59-43-23-21-41-31-49-45-19-7-9-25-53(45,47(41)33-43)27-29-55(49)35-39-15-11-16-39)13-5-3-4-6-14-38(2)52(58)60-44-24-22-42-32-50-46-20-8-10-26-54(46,48(42)34-44)28-30-56(50)36-40-17-12-18-40/h21-24,33-34,37-40,45-46,49-50H,3-20,25-32,35-36H2,1-2H3/t37?,38?,45-,46-,49+,50+,53+,54+/m0/s1
NCI pathway
Reactome pathway
0.950n/an/an/an/an/an/an/an/a
Harvard Medical School
Curated by ChEMBL
Assay Description
Displacement of [3H]DAMGO from human mu opioid receptor expressed in CHO cells after 60 mins by liquid scintillation counting
J Med Chem 52: 7389-96 (2009)
Article DOI: 10.1021/jm900379p
BindingDB Entry DOI: 10.7270/Q29P31Q8
Delta-type opioid receptor
(Homo sapiens (Human))
BDBM50300377
(Bis((-)-N-cyclobutylmethylmorphinan-3-yl)2,9-Dimet...)
Show SMILES CC(CCCCCCC(C)C(=O)Oc1ccc2C[C@@H]3[C@@H]4CCCC[C@]4(CCN3CC3CCC3)c2c1)C(=O)Oc1ccc2C[C@@H]3[C@@H]4CCCC[C@]4(CCN3CC3CCC3)c2c1 |r|
Show InChI InChI=1S/C54H76N2O4/c1-37(51(57)59-43-23-21-41-31-49-45-19-7-9-25-53(45,47(41)33-43)27-29-55(49)35-39-15-11-16-39)13-5-3-4-6-14-38(2)52(58)60-44-24-22-42-32-50-46-20-8-10-26-54(46,48(42)34-44)28-30-56(50)36-40-17-12-18-40/h21-24,33-34,37-40,45-46,49-50H,3-20,25-32,35-36H2,1-2H3/t37?,38?,45-,46-,49+,50+,53+,54+/m0/s1
Reactome pathway
37n/an/an/an/an/an/an/an/a
Harvard Medical School
Curated by ChEMBL
Assay Description
Displacement of [3H]naltrindole from human delta opioid receptor expressed in CHO cells after 3 hrs by liquid scintillation counting
J Med Chem 52: 7389-96 (2009)
Article DOI: 10.1021/jm900379p
BindingDB Entry DOI: 10.7270/Q29P31Q8
Kappa-type opioid receptor
(Homo sapiens (Human))
BDBM50300377
(Bis((-)-N-cyclobutylmethylmorphinan-3-yl)2,9-Dimet...)
Show SMILES CC(CCCCCCC(C)C(=O)Oc1ccc2C[C@@H]3[C@@H]4CCCC[C@]4(CCN3CC3CCC3)c2c1)C(=O)Oc1ccc2C[C@@H]3[C@@H]4CCCC[C@]4(CCN3CC3CCC3)c2c1 |r|
Show InChI InChI=1S/C54H76N2O4/c1-37(51(57)59-43-23-21-41-31-49-45-19-7-9-25-53(45,47(41)33-43)27-29-55(49)35-39-15-11-16-39)13-5-3-4-6-14-38(2)52(58)60-44-24-22-42-32-50-46-20-8-10-26-54(46,48(42)34-44)28-30-56(50)36-40-17-12-18-40/h21-24,33-34,37-40,45-46,49-50H,3-20,25-32,35-36H2,1-2H3/t37?,38?,45-,46-,49+,50+,53+,54+/m0/s1
Reactome pathway
n/an/an/an/a 7.30n/an/an/an/a
Harvard Medical School
Curated by ChEMBL
Assay Description
Agonist activity at human kappa opioid receptor expressed in CHO cells assessed as stimulation of [35S]GTPgammaS binding
J Med Chem 52: 7389-96 (2009)
Article DOI: 10.1021/jm900379p
BindingDB Entry DOI: 10.7270/Q29P31Q8
Mu-type opioid receptor
(Homo sapiens (Human))
BDBM50300377
(Bis((-)-N-cyclobutylmethylmorphinan-3-yl)2,9-Dimet...)
Show SMILES CC(CCCCCCC(C)C(=O)Oc1ccc2C[C@@H]3[C@@H]4CCCC[C@]4(CCN3CC3CCC3)c2c1)C(=O)Oc1ccc2C[C@@H]3[C@@H]4CCCC[C@]4(CCN3CC3CCC3)c2c1 |r|
Show InChI InChI=1S/C54H76N2O4/c1-37(51(57)59-43-23-21-41-31-49-45-19-7-9-25-53(45,47(41)33-43)27-29-55(49)35-39-15-11-16-39)13-5-3-4-6-14-38(2)52(58)60-44-24-22-42-32-50-46-20-8-10-26-54(46,48(42)34-44)28-30-56(50)36-40-17-12-18-40/h21-24,33-34,37-40,45-46,49-50H,3-20,25-32,35-36H2,1-2H3/t37?,38?,45-,46-,49+,50+,53+,54+/m0/s1
NCI pathway
Reactome pathway
n/an/an/an/a 7.10n/an/an/an/a
Harvard Medical School
Curated by ChEMBL
Assay Description
Agonist activity at human mu opioid receptor expressed in CHO cells assessed as stimulation of [35S]GTPgammaS binding
J Med Chem 52: 7389-96 (2009)
Article DOI: 10.1021/jm900379p
BindingDB Entry DOI: 10.7270/Q29P31Q8
Mu-type opioid receptor
(Homo sapiens (Human))
BDBM50300377
(Bis((-)-N-cyclobutylmethylmorphinan-3-yl)2,9-Dimet...)
Show SMILES CC(CCCCCCC(C)C(=O)Oc1ccc2C[C@@H]3[C@@H]4CCCC[C@]4(CCN3CC3CCC3)c2c1)C(=O)Oc1ccc2C[C@@H]3[C@@H]4CCCC[C@]4(CCN3CC3CCC3)c2c1 |r|
Show InChI InChI=1S/C54H76N2O4/c1-37(51(57)59-43-23-21-41-31-49-45-19-7-9-25-53(45,47(41)33-43)27-29-55(49)35-39-15-11-16-39)13-5-3-4-6-14-38(2)52(58)60-44-24-22-42-32-50-46-20-8-10-26-54(46,48(42)34-44)28-30-56(50)36-40-17-12-18-40/h21-24,33-34,37-40,45-46,49-50H,3-20,25-32,35-36H2,1-2H3/t37?,38?,45-,46-,49+,50+,53+,54+/m0/s1
NCI pathway
Reactome pathway
n/an/a 140n/an/an/an/an/an/a
Harvard Medical School
Curated by ChEMBL
Assay Description
Antagonist activity at human mu opioid receptor expressed in CHO cells assessed as inhibition of DAMGO-stimulated [35S]GTPgammaS binding
J Med Chem 52: 7389-96 (2009)
Article DOI: 10.1021/jm900379p
BindingDB Entry DOI: 10.7270/Q29P31Q8