BDBM50300519 (1S,2R)-1-(3-fluorophenyl)-1-(4-methyl-1H-indol-1-yl)-3-(methylamino)propan-2-ol::CHEMBL574921
SMILES: CNC[C@@H](O)[C@H](c1cccc(F)c1)n1ccc2c(C)cccc12
InChI Key: InChIKey=VLLHQEDHCOUXKK-MOPGFXCFSA-N
Data: 2 IC50
Activity Spreadsheet -- Enzyme Inhibition Constant Data from BindingDB
Found 2 hits for monomerid = 50300519
Trg + Lig
Ki
nM
ΔG°
kcal/mole
IC50
nM
Kd
nM
EC50/IC50
nM
koff
s-1
kon
M-1s-1
pHTemp
°C
Sodium-dependent noradrenaline transporter
(Homo sapiens (Human))
BDBM50300519
((1S,2R)-1-(3-fluorophenyl)-1-(4-methyl-1H-indol-1-...)
Show SMILES CNC[C@@H](O)[C@H](c1cccc(F)c1)n1ccc2c(C)cccc12 |r|
Show InChI InChI=1S/C19H21FN2O/c1-13-5-3-8-17-16(13)9-10-22(17)19(18(23)12-21-2)14-6-4-7-15(20)11-14/h3-11,18-19,21,23H,12H2,1-2H3/t18-,19+/m1/s1
Reactome pathway
n/an/a 15n/an/an/an/an/an/a
Wyeth Research
Curated by ChEMBL
Assay Description
Inhibition of human NET expressed in MDCK-Net6 cells
Bioorg Med Chem Lett 19: 5807-10 (2009)
Article DOI: 10.1016/j.bmcl.2009.07.050
BindingDB Entry DOI: 10.7270/Q2H70FV8
Sodium-dependent serotonin transporter
(Homo sapiens (Human))
BDBM50300519
((1S,2R)-1-(3-fluorophenyl)-1-(4-methyl-1H-indol-1-...)
Show SMILES CNC[C@@H](O)[C@H](c1cccc(F)c1)n1ccc2c(C)cccc12 |r|
Show InChI InChI=1S/C19H21FN2O/c1-13-5-3-8-17-16(13)9-10-22(17)19(18(23)12-21-2)14-6-4-7-15(20)11-14/h3-11,18-19,21,23H,12H2,1-2H3/t18-,19+/m1/s1
n/an/a 228n/an/an/an/an/an/a
Wyeth Research
Curated by ChEMBL
Assay Description
Inhibition of human SERT expressed in JAR cells
Bioorg Med Chem Lett 19: 5807-10 (2009)
Article DOI: 10.1016/j.bmcl.2009.07.050
BindingDB Entry DOI: 10.7270/Q2H70FV8