BDBM50300536 (1S,2R)-1-(3-chlorophenyl)-1-(1H-indol-1-yl)-3-(methylamino)propan-2-ol::CHEMBL575535
SMILES: CNC[C@@H](O)[C@H](c1cccc(Cl)c1)n1ccc2ccccc12
InChI Key: InChIKey=UIJBKUNWEPERDV-MSOLQXFVSA-N
Data: 2 IC50
Activity Spreadsheet -- Enzyme Inhibition Constant Data from BindingDB
Found 2 hits for monomerid = 50300536
Trg + Lig
Ki
nM
ΔG°
kcal/mole
IC50
nM
Kd
nM
EC50/IC50
nM
koff
s-1
kon
M-1s-1
pHTemp
°C
Sodium-dependent noradrenaline transporter
(Homo sapiens (Human))
BDBM50300536
((1S,2R)-1-(3-chlorophenyl)-1-(1H-indol-1-yl)-3-(me...)
Show SMILES CNC[C@@H](O)[C@H](c1cccc(Cl)c1)n1ccc2ccccc12 |r|
Show InChI InChI=1S/C18H19ClN2O/c1-20-12-17(22)18(14-6-4-7-15(19)11-14)21-10-9-13-5-2-3-8-16(13)21/h2-11,17-18,20,22H,12H2,1H3/t17-,18+/m1/s1
Reactome pathway
n/an/a 16n/an/an/an/an/an/a
Wyeth Research
Curated by ChEMBL
Assay Description
Inhibition of human NET expressed in MDCK-Net6 cells
Bioorg Med Chem Lett 19: 5807-10 (2009)
Article DOI: 10.1016/j.bmcl.2009.07.050
BindingDB Entry DOI: 10.7270/Q2H70FV8
Sodium-dependent serotonin transporter
(Homo sapiens (Human))
BDBM50300536
((1S,2R)-1-(3-chlorophenyl)-1-(1H-indol-1-yl)-3-(me...)
Show SMILES CNC[C@@H](O)[C@H](c1cccc(Cl)c1)n1ccc2ccccc12 |r|
Show InChI InChI=1S/C18H19ClN2O/c1-20-12-17(22)18(14-6-4-7-15(19)11-14)21-10-9-13-5-2-3-8-16(13)21/h2-11,17-18,20,22H,12H2,1H3/t17-,18+/m1/s1
n/an/a 554n/an/an/an/an/an/a
Wyeth Research
Curated by ChEMBL
Assay Description
Inhibition of human SERT expressed in JAR cells
Bioorg Med Chem Lett 19: 5807-10 (2009)
Article DOI: 10.1016/j.bmcl.2009.07.050
BindingDB Entry DOI: 10.7270/Q2H70FV8