BDBM50300695 CHEMBL575269::N-(5-tert-Butyl-isoxazol-3-yl)-N'-{4-[7-(2-piperidin-1-yl-ethoxy)imidazo[2,1-b][1,3]benzothiazol-2-yl]phenyl}urea
SMILES: CC(C)(C)c1cc(NC(=O)Nc2ccc(cc2)-c2cn3c(n2)sc2cc(OCCN4CCCCC4)ccc32)no1
InChI Key: InChIKey=HRTFJSPOQWWRIM-UHFFFAOYSA-N
Data: 1 Kd
Activity Spreadsheet -- Enzyme Inhibition Constant Data from BindingDB
Found 1 hit for monomerid = 50300695
Trg + Lig
Ki
nM
ΔG°
kcal/mole
IC50
nM
Kd
nM
EC50/IC50
nM
koff
s-1
kon
M-1s-1
pHTemp
°C
Receptor-type tyrosine-protein kinase FLT3
(Homo sapiens (Human))
BDBM50300695
(CHEMBL575269 | N-(5-tert-Butyl-isoxazol-3-yl)-N'-{...)
Show SMILES CC(C)(C)c1cc(NC(=O)Nc2ccc(cc2)-c2cn3c(n2)sc2cc(OCCN4CCCCC4)ccc32)no1
Show InChI InChI=1S/C30H34N6O3S/c1-30(2,3)26-18-27(34-39-26)33-28(37)31-21-9-7-20(8-10-21)23-19-36-24-12-11-22(17-25(24)40-29(36)32-23)38-16-15-35-13-5-4-6-14-35/h7-12,17-19H,4-6,13-16H2,1-3H3,(H2,31,33,34,37)
n/an/an/a 1.5n/an/an/an/an/a
Ambit Biosciences
Curated by ChEMBL
Assay Description
Binding affinity to FLT3 catalytic domain expressed in HEK293 cells by competitive binding assay
J Med Chem 52: 7808-16 (2009)
Article DOI: 10.1021/jm9007533
BindingDB Entry DOI: 10.7270/Q2319VZ6