BDBM50300701 2-{4-[3-(5-tert-Butyl-isoxazol-3-yl)ureido]phenyl}imidazo[2,1-b][1,3]benzothiazole-7-carboxylate::CHEMBL584710
SMILES: CC(C)(C)c1cc(NC(=O)Nc2ccc(cc2)-c2cn3c(n2)sc2cc(ccc32)C(O)=O)no1
InChI Key: InChIKey=WCKIQBNFMHWBGG-UHFFFAOYSA-N
Data: 1 Kd
Activity Spreadsheet -- Enzyme Inhibition Constant Data from BindingDB
Found 1 hit for monomerid = 50300701
Trg + Lig
Ki
nM
ΔG°
kcal/mole
IC50
nM
Kd
nM
EC50/IC50
nM
koff
s-1
kon
M-1s-1
pHTemp
°C
Receptor-type tyrosine-protein kinase FLT3
(Homo sapiens (Human))
BDBM50300701
(2-{4-[3-(5-tert-Butyl-isoxazol-3-yl)ureido]phenyl}...)
Show SMILES CC(C)(C)c1cc(NC(=O)Nc2ccc(cc2)-c2cn3c(n2)sc2cc(ccc32)C(O)=O)no1
Show InChI InChI=1S/C24H21N5O4S/c1-24(2,3)19-11-20(28-33-19)27-22(32)25-15-7-4-13(5-8-15)16-12-29-17-9-6-14(21(30)31)10-18(17)34-23(29)26-16/h4-12H,1-3H3,(H,30,31)(H2,25,27,28,32)
n/an/an/a 1.60n/an/an/an/an/a
Ambit Biosciences
Curated by ChEMBL
Assay Description
Binding affinity to FLT3 catalytic domain expressed in HEK293 cells by competitive binding assay
J Med Chem 52: 7808-16 (2009)
Article DOI: 10.1021/jm9007533
BindingDB Entry DOI: 10.7270/Q2319VZ6