BDBM50300886 4-(3-(4-fluorophenyl)-5-isopropylisoxazol-4-yl)-N-(tetrahydro-2H-pyran-4-yl)pyridin-2-amine::CHEMBL569552
SMILES: CC(C)c1onc(c1-c1ccnc(NC2CCOCC2)c1)-c1ccc(F)cc1
InChI Key: InChIKey=DBWVMDRPEVOBMO-UHFFFAOYSA-N
Data: 2 IC50
Activity Spreadsheet -- Enzyme Inhibition Constant Data from BindingDB
Found 2 hits for monomerid = 50300886
Trg + Lig
Ki
nM
ΔG°
kcal/mole
IC50
nM
Kd
nM
EC50/IC50
nM
koff
s-1
kon
M-1s-1
pHTemp
°C
Casein kinase I isoform delta
(Homo sapiens (Human))
BDBM50300886
(4-(3-(4-fluorophenyl)-5-isopropylisoxazol-4-yl)-N-...)
Show SMILES CC(C)c1onc(c1-c1ccnc(NC2CCOCC2)c1)-c1ccc(F)cc1
Show InChI InChI=1S/C22H24FN3O2/c1-14(2)22-20(21(26-28-22)15-3-5-17(23)6-4-15)16-7-10-24-19(13-16)25-18-8-11-27-12-9-18/h3-7,10,13-14,18H,8-9,11-12H2,1-2H3,(H,24,25)
n/an/a 2.50E+3n/an/an/an/an/an/a
Eberhard-Karls-University
Curated by ChEMBL
Assay Description
Inhibition of recombinant CK1delta kinase domain by Cherenkov counting
J Med Chem 52: 7618-30 (2009)
Article DOI: 10.1021/jm9005127
BindingDB Entry DOI: 10.7270/Q28K7961
Mitogen-activated protein kinase 14
(Homo sapiens (Human))
BDBM50300886
(4-(3-(4-fluorophenyl)-5-isopropylisoxazol-4-yl)-N-...)
Show SMILES CC(C)c1onc(c1-c1ccnc(NC2CCOCC2)c1)-c1ccc(F)cc1
Show InChI InChI=1S/C22H24FN3O2/c1-14(2)22-20(21(26-28-22)15-3-5-17(23)6-4-15)16-7-10-24-19(13-16)25-18-8-11-27-12-9-18/h3-7,10,13-14,18H,8-9,11-12H2,1-2H3,(H,24,25)
NCI pathway
Reactome pathway
n/an/a 60n/an/an/an/an/an/a
Eberhard-Karls-University
Curated by ChEMBL
Assay Description
Inhibition of p38alpha by Cherenkov counting
J Med Chem 52: 7618-30 (2009)
Article DOI: 10.1021/jm9005127
BindingDB Entry DOI: 10.7270/Q28K7961