BDBM50300892 (E)-3-(2,4-dimethoxyphenyl)-N-(4-(3-(4-fluorophenyl)-5-isopropylisoxazol-4-yl)pyridin-2-yl)acrylamide::CHEMBL571142
SMILES: COc1ccc(\C=C\C(=O)Nc2cc(ccn2)-c2c(noc2C(C)C)-c2ccc(F)cc2)c(OC)c1
InChI Key: InChIKey=HSYSAQACEYOOEZ-XYOKQWHBSA-N
Data: 3 IC50
Activity Spreadsheet -- Enzyme Inhibition Constant Data from BindingDB
Found 3 hits for monomerid = 50300892
Trg + Lig
Ki
nM
ΔG°
kcal/mole
IC50
nM
Kd
nM
EC50/IC50
nM
koff
s-1
kon
M-1s-1
pHTemp
°C
Mitogen-activated protein kinase 14
(Homo sapiens (Human))
BDBM50300892
((E)-3-(2,4-dimethoxyphenyl)-N-(4-(3-(4-fluoropheny...)
Show SMILES COc1ccc(\C=C\C(=O)Nc2cc(ccn2)-c2c(noc2C(C)C)-c2ccc(F)cc2)c(OC)c1
Show InChI InChI=1S/C28H26FN3O4/c1-17(2)28-26(27(32-36-28)19-5-9-21(29)10-6-19)20-13-14-30-24(15-20)31-25(33)12-8-18-7-11-22(34-3)16-23(18)35-4/h5-17H,1-4H3,(H,30,31,33)/b12-8+
NCI pathway
Reactome pathway
n/an/a 2.52E+3n/an/an/an/an/an/a
Eberhard-Karls-University
Curated by ChEMBL
Assay Description
Inhibition of p38alpha by Cherenkov counting
J Med Chem 52: 7618-30 (2009)
Article DOI: 10.1021/jm9005127
BindingDB Entry DOI: 10.7270/Q28K7961
Casein kinase I delta
(Rattus norvegicus (rat))
BDBM50300892
((E)-3-(2,4-dimethoxyphenyl)-N-(4-(3-(4-fluoropheny...)
Show SMILES COc1ccc(\C=C\C(=O)Nc2cc(ccn2)-c2c(noc2C(C)C)-c2ccc(F)cc2)c(OC)c1
Show InChI InChI=1S/C28H26FN3O4/c1-17(2)28-26(27(32-36-28)19-5-9-21(29)10-6-19)20-13-14-30-24(15-20)31-25(33)12-8-18-7-11-22(34-3)16-23(18)35-4/h5-17H,1-4H3,(H,30,31,33)/b12-8+
n/an/a 47n/an/an/an/an/an/a
Eberhard-Karls-University
Curated by ChEMBL
Assay Description
Inhibition of GST-fused rat CK1delta by Cherenkov counting in presence of 20 uM ATP
J Med Chem 52: 7618-30 (2009)
Article DOI: 10.1021/jm9005127
BindingDB Entry DOI: 10.7270/Q28K7961
Casein kinase I isoform delta
(Homo sapiens (Human))
BDBM50300892
((E)-3-(2,4-dimethoxyphenyl)-N-(4-(3-(4-fluoropheny...)
Show SMILES COc1ccc(\C=C\C(=O)Nc2cc(ccn2)-c2c(noc2C(C)C)-c2ccc(F)cc2)c(OC)c1
Show InChI InChI=1S/C28H26FN3O4/c1-17(2)28-26(27(32-36-28)19-5-9-21(29)10-6-19)20-13-14-30-24(15-20)31-25(33)12-8-18-7-11-22(34-3)16-23(18)35-4/h5-17H,1-4H3,(H,30,31,33)/b12-8+
n/an/a 33n/an/an/an/an/an/a
Eberhard-Karls-University
Curated by ChEMBL
Assay Description
Inhibition of recombinant CK1delta kinase domain by Cherenkov counting
J Med Chem 52: 7618-30 (2009)
Article DOI: 10.1021/jm9005127
BindingDB Entry DOI: 10.7270/Q28K7961