BDBM50300987 3-(3-hydroxypropylamino)-7-(6-methoxypyridin-3-yl)-1-(2-propoxyethyl)pyrido[3,4-b]pyrazin-2(1H)-one::CHEMBL567447
SMILES: CCCOCCn1c2cc(ncc2nc(NCCCO)c1=O)-c1ccc(OC)nc1
InChI Key: InChIKey=CJSDBNCLEJAPLO-UHFFFAOYSA-N
Data: 2 IC50
Activity Spreadsheet -- Enzyme Inhibition Constant Data from BindingDB
Found 2 hits for monomerid = 50300987
Trg + Lig
Ki
nM
ΔG°
kcal/mole
IC50
nM
Kd
nM
EC50/IC50
nM
koff
s-1
kon
M-1s-1
pHTemp
°C
Rod cGMP-specific 3',5'-cyclic phosphodiesterase alpha
(Homo sapiens (Human))
BDBM50300987
(3-(3-hydroxypropylamino)-7-(6-methoxypyridin-3-yl)...)
Show SMILES CCCOCCn1c2cc(ncc2nc(NCCCO)c1=O)-c1ccc(OC)nc1
Show InChI InChI=1S/C21H27N5O4/c1-3-10-30-11-8-26-18-12-16(15-5-6-19(29-2)24-13-15)23-14-17(18)25-20(21(26)28)22-7-4-9-27/h5-6,12-14,27H,3-4,7-11H2,1-2H3,(H,22,25)
NCI pathway
Reactome pathway
n/an/a 14n/an/an/an/an/an/a
Pfizer Global Research and Development
Curated by ChEMBL
Assay Description
Inhibition of PDE6
Bioorg Med Chem Lett 19: 5209-13 (2009)
Article DOI: 10.1016/j.bmcl.2009.07.019
BindingDB Entry DOI: 10.7270/Q2H41RHV
cGMP-specific 3',5'-cyclic phosphodiesterase
(Homo sapiens (Human))
BDBM50300987
(3-(3-hydroxypropylamino)-7-(6-methoxypyridin-3-yl)...)
Show SMILES CCCOCCn1c2cc(ncc2nc(NCCCO)c1=O)-c1ccc(OC)nc1
Show InChI InChI=1S/C21H27N5O4/c1-3-10-30-11-8-26-18-12-16(15-5-6-19(29-2)24-13-15)23-14-17(18)25-20(21(26)28)22-7-4-9-27/h5-6,12-14,27H,3-4,7-11H2,1-2H3,(H,22,25)
Reactome pathway
n/an/a 0.260n/an/an/an/an/an/a
Pfizer Global Research and Development
Curated by ChEMBL
Assay Description
Inhibition of PDE5
Bioorg Med Chem Lett 19: 5209-13 (2009)
Article DOI: 10.1016/j.bmcl.2009.07.019
BindingDB Entry DOI: 10.7270/Q2H41RHV