BDBM50301368 CHEMBL570189::N-(5-(7-methoxyquinolin-4-yloxy)pyridin-2-yl)-2-oxo-1-phenyl-5-(pyrazin-2-yl)-1,2-dihydropyridine-3-carboxamide
SMILES: COc1ccc2c(Oc3ccc(NC(=O)c4cc(cn(-c5ccccc5)c4=O)-c4cnccn4)nc3)ccnc2c1
InChI Key: InChIKey=KFDHIQVUEANUNN-UHFFFAOYSA-N
Data: 2 IC50
Activity Spreadsheet -- Enzyme Inhibition Constant Data from BindingDB
Found 2 hits for monomerid = 50301368
Trg + Lig
Ki
nM
ΔG°
kcal/mole
IC50
nM
Kd
nM
EC50/IC50
nM
koff
s-1
kon
M-1s-1
pHTemp
°C
Focal adhesion kinase 1
(Homo sapiens (Human))
BDBM50301368
(CHEMBL570189 | N-(5-(7-methoxyquinolin-4-yloxy)pyr...)
Show SMILES COc1ccc2c(Oc3ccc(NC(=O)c4cc(cn(-c5ccccc5)c4=O)-c4cnccn4)nc3)ccnc2c1
Show InChI InChI=1S/C31H22N6O4/c1-40-22-7-9-24-26(16-22)33-12-11-28(24)41-23-8-10-29(35-17-23)36-30(38)25-15-20(27-18-32-13-14-34-27)19-37(31(25)39)21-5-3-2-4-6-21/h2-19H,1H3,(H,35,36,38)
NCI pathway
Reactome pathway
n/an/a>1.25E+5n/an/an/an/an/an/a
Amgen Inc.
Curated by ChEMBL
Assay Description
Inhibition of human FAK by HTRF assay
Bioorg Med Chem Lett 19: 4924-8 (2009)
Article DOI: 10.1016/j.bmcl.2009.07.084
BindingDB Entry DOI: 10.7270/Q2N017G2
PTK2B protein tyrosine kinase 2 beta (PTK2B)
(Homo sapiens (Human))
BDBM50301368
(CHEMBL570189 | N-(5-(7-methoxyquinolin-4-yloxy)pyr...)
Show SMILES COc1ccc2c(Oc3ccc(NC(=O)c4cc(cn(-c5ccccc5)c4=O)-c4cnccn4)nc3)ccnc2c1
Show InChI InChI=1S/C31H22N6O4/c1-40-22-7-9-24-26(16-22)33-12-11-28(24)41-23-8-10-29(35-17-23)36-30(38)25-15-20(27-18-32-13-14-34-27)19-37(31(25)39)21-5-3-2-4-6-21/h2-19H,1H3,(H,35,36,38)
n/an/a 1.00E+3n/an/an/an/an/an/a
Amgen Inc.
Curated by ChEMBL
Assay Description
Inhibition of human Pyk2 by HTRF assay
Bioorg Med Chem Lett 19: 4924-8 (2009)
Article DOI: 10.1016/j.bmcl.2009.07.084
BindingDB Entry DOI: 10.7270/Q2N017G2