BDBM50301541 CHEMBL577729::N-(4-(6-aminopyrimidin-4-yl)thiazol-2-yl)-4-fluoro-N-methylbenzamide
SMILES: CN(C(=O)c1ccc(F)cc1)c1nc(cs1)-c1cc(N)ncn1
InChI Key: InChIKey=YWZHEOSSJGFKBA-UHFFFAOYSA-N
Data: 2 IC50
Activity Spreadsheet -- Enzyme Inhibition Constant Data from BindingDB
Found 2 hits for monomerid = 50301541
Trg + Lig
Ki
nM
ΔG°
kcal/mole
IC50
nM
Kd
nM
EC50/IC50
nM
koff
s-1
kon
M-1s-1
pHTemp
°C
Metabotropic glutamate receptor 5
(Homo sapiens (Human))
BDBM50301541
(CHEMBL577729 | N-(4-(6-aminopyrimidin-4-yl)thiazol...)
Show SMILES CN(C(=O)c1ccc(F)cc1)c1nc(cs1)-c1cc(N)ncn1
Show InChI InChI=1S/C15H12FN5OS/c1-21(14(22)9-2-4-10(16)5-3-9)15-20-12(7-23-15)11-6-13(17)19-8-18-11/h2-8H,1H3,(H2,17,18,19)
n/an/a>1.00E+4n/an/an/an/an/an/a
Tsukuba Research Institute
Curated by ChEMBL
Assay Description
Antagonist activity at human mGluR5 receptor expressed in CHO cells by FLIPR assay
Bioorg Med Chem Lett 19: 5464-8 (2009)
Article DOI: 10.1016/j.bmcl.2009.07.097
BindingDB Entry DOI: 10.7270/Q2W66KTT
Metabotropic glutamate receptor 1
(Homo sapiens (Human))
BDBM50301541
(CHEMBL577729 | N-(4-(6-aminopyrimidin-4-yl)thiazol...)
Show SMILES CN(C(=O)c1ccc(F)cc1)c1nc(cs1)-c1cc(N)ncn1
Show InChI InChI=1S/C15H12FN5OS/c1-21(14(22)9-2-4-10(16)5-3-9)15-20-12(7-23-15)11-6-13(17)19-8-18-11/h2-8H,1H3,(H2,17,18,19)
n/an/a 2.40n/an/an/an/an/an/a
Tsukuba Research Institute
Curated by ChEMBL
Assay Description
Antagonist activity at human mGluR1 receptor expressed in CHO cells by FLIPR assay
Bioorg Med Chem Lett 19: 5464-8 (2009)
Article DOI: 10.1016/j.bmcl.2009.07.097
BindingDB Entry DOI: 10.7270/Q2W66KTT