BDBM50301559 CHEMBL569249::N-(4-carbamimidoylbenzyl)-2-(1-(2,5-dimethylphenylsulfonamido)-4-methyl-2-oxo-1,2,5,6-tetrahydropyridin-3-yl)acetamide
SMILES: CC1=C(CC(=O)NCc2ccc(cc2)C(N)=N)C(=O)N(CC1)NS(=O)(=O)c1cc(C)ccc1C
InChI Key: InChIKey=QMBBOUUMICXCBS-UHFFFAOYSA-N
Data: 1 IC50
Activity Spreadsheet -- Enzyme Inhibition Constant Data from BindingDB
Found 1 hit for monomerid = 50301559
Trg + Lig
Ki
nM
ΔG°
kcal/mole
IC50
nM
Kd
nM
EC50/IC50
nM
koff
s-1
kon
M-1s-1
pHTemp
°C
Prothrombin
(Homo sapiens (Human))
BDBM50301559
(CHEMBL569249 | N-(4-carbamimidoylbenzyl)-2-(1-(2,5...)
Show SMILES CC1=C(CC(=O)NCc2ccc(cc2)C(N)=N)C(=O)N(CC1)NS(=O)(=O)c1cc(C)ccc1C |c:1|
Show InChI InChI=1S/C24H29N5O4S/c1-15-4-5-17(3)21(12-15)34(32,33)28-29-11-10-16(2)20(24(29)31)13-22(30)27-14-18-6-8-19(9-7-18)23(25)26/h4-9,12,28H,10-11,13-14H2,1-3H3,(H3,25,26)(H,27,30)
n/an/a 6n/an/an/an/an/an/a
Universit£ de Montr£al
Curated by ChEMBL
Assay Description
Inhibition of human thrombin
Bioorg Med Chem Lett 19: 5429-32 (2009)
Article DOI: 10.1016/j.bmcl.2009.07.107
BindingDB Entry DOI: 10.7270/Q2MP53BQ