BDBM50301562 CHEMBL584260::N-(4-carbamimidoylbenzyl)-2-(1-(2-chloro-6-methylphenylsulfonamido)-4-methyl-2-oxo-1,2,5,6-tetrahydropyridin-3-yl)acetamide
SMILES: CC1=C(CC(=O)NCc2ccc(cc2)C(N)=N)C(=O)N(CC1)NS(=O)(=O)c1c(C)cccc1Cl
InChI Key: InChIKey=GBTNQKZHXAJHFY-UHFFFAOYSA-N
Data: 1 IC50
Activity Spreadsheet -- Enzyme Inhibition Constant Data from BindingDB
Found 1 hit for monomerid = 50301562
Trg + Lig
Ki
nM
ΔG°
kcal/mole
IC50
nM
Kd
nM
EC50/IC50
nM
koff
s-1
kon
M-1s-1
pHTemp
°C
Prothrombin
(Homo sapiens (Human))
BDBM50301562
(CHEMBL584260 | N-(4-carbamimidoylbenzyl)-2-(1-(2-c...)
Show SMILES CC1=C(CC(=O)NCc2ccc(cc2)C(N)=N)C(=O)N(CC1)NS(=O)(=O)c1c(C)cccc1Cl |c:1|
Show InChI InChI=1S/C23H26ClN5O4S/c1-14-10-11-29(28-34(32,33)21-15(2)4-3-5-19(21)24)23(31)18(14)12-20(30)27-13-16-6-8-17(9-7-16)22(25)26/h3-9,28H,10-13H2,1-2H3,(H3,25,26)(H,27,30)
n/an/a 3n/an/an/an/an/an/a
Universit£ de Montr£al
Curated by ChEMBL
Assay Description
Inhibition of human thrombin
Bioorg Med Chem Lett 19: 5429-32 (2009)
Article DOI: 10.1016/j.bmcl.2009.07.107
BindingDB Entry DOI: 10.7270/Q2MP53BQ