null
SMILES: C[C@H](Nc1nccc(n1)-n1cnc2ccccc12)[C@]1(C)CN(CCN1C)C(=O)Nc1cccc2ccccc12
InChI Key: InChIKey=VNQWUKJBGRJFGB-JRPXNJEYSA-N
Activity Spreadsheet -- Enzyme Inhibition Constant Data from BindingDB
Found 1 hit for monomerid = 50301621
Trg + Lig
Ki
nM
ΔG°
kcal/mole
IC50
nM
Kd
nM
EC50/IC50
nM
koff
s-1
kon
M-1s-1
pHTemp
°C
Tyrosine-protein kinase Lck
(Homo sapiens (Human))
BDBM50301621
((S)-3-((S)-1-(4-(1H-benzo[d]imidazol-1-yl)pyrimidi...)
Show SMILES C[C@H](Nc1nccc(n1)-n1cnc2ccccc12)[C@]1(C)CN(CCN1C)C(=O)Nc1cccc2ccccc12 |r|
Show InChI InChI=1S/C30H32N8O/c1-21(33-28-31-16-15-27(35-28)38-20-32-25-12-6-7-14-26(25)38)30(2)19-37(18-17-36(30)3)29(39)34-24-13-8-10-22-9-4-5-11-23(22)24/h4-16,20-21H,17-19H2,1-3H3,(H,34,39)(H,31,33,35)/t21-,30-/m0/s1
n/an/a 1n/an/an/an/an/an/a
Merck Research Laboratories
Curated by ChEMBL
Assay Description
Inhibition of Lck
Bioorg Med Chem Lett 19: 5440-3 (2009)
Article DOI: 10.1016/j.bmcl.2009.07.102
BindingDB Entry DOI: 10.7270/Q2GX4BM0