null
SMILES: Cc1cc(=O)n(CCCOCc2ccccc2)c(n1)N1CCNCC1
InChI Key: InChIKey=NOXGPUCFCIDFLF-UHFFFAOYSA-N
Activity Spreadsheet -- Enzyme Inhibition Constant Data from BindingDB
Found 1 hit for monomerid = 50301789
Trg + Lig
Ki
nM
ΔG°
kcal/mole
IC50
nM
Kd
nM
EC50/IC50
nM
koff
s-1
kon
M-1s-1
pHTemp
°C
5-hydroxytryptamine receptor 2C
(Homo sapiens (Human))
BDBM50301789
(3-(3-(benzyloxy)propyl)-6-methyl-2-(piperazin-1-yl...)
Show SMILES Cc1cc(=O)n(CCCOCc2ccccc2)c(n1)N1CCNCC1
Show InChI InChI=1S/C19H26N4O2/c1-16-14-18(24)23(19(21-16)22-11-8-20-9-12-22)10-5-13-25-15-17-6-3-2-4-7-17/h2-4,6-7,14,20H,5,8-13,15H2,1H3
Reactome pathway
n/an/an/an/a>1.00E+4n/an/an/an/a
Pfizer Global Research and Development
Curated by ChEMBL
Assay Description
Agonist activity at human recombinant 5HT2C receptor expressed in CHO K1 cells assessed as calcium mobilisation by FLIPR assay
Bioorg Med Chem Lett 19: 5346-50 (2009)
Article DOI: 10.1016/j.bmcl.2009.07.133
BindingDB Entry DOI: 10.7270/Q2B56JT3