BDBM50301900 CHEMBL568894::N-{3-[(S)-5-tert-Butyl-1-(4-fluoro-benzyl)-4-hydroxy-2-oxo-2,5-dihydro-1H-pyrrol-3-yl]-1,1-dioxo-1,4-dihydro-1lambda*6*-benzo[1,4]thiazin-7-yl}-methanesulfonamide
SMILES: CC(C)(C)[C@@H]1N(Cc2ccc(F)cc2)C(=O)C(C1=O)C1=Nc2ccc(NS(C)(=O)=O)cc2S(=O)(=O)C1
InChI Key: InChIKey=CPANVZVANFTTIW-LWMIZPGFSA-N
Data: 1 IC50
Activity Spreadsheet -- Enzyme Inhibition Constant Data from BindingDB
Found 1 hit for monomerid = 50301900
Trg + Lig
Ki
nM
ΔG°
kcal/mole
IC50
nM
Kd
nM
EC50/IC50
nM
koff
s-1
kon
M-1s-1
pHTemp
°C
RNA polymerase (NS5B)
(Hepatitis C virus (HCV))
BDBM50301900
(CHEMBL568894 | N-{3-[(S)-5-tert-Butyl-1-(4-fluoro-...)
Show SMILES CC(C)(C)[C@@H]1N(Cc2ccc(F)cc2)C(=O)C(C1=O)C1=Nc2ccc(NS(C)(=O)=O)cc2S(=O)(=O)C1 |r,t:21|
Show InChI InChI=1S/C24H26FN3O6S2/c1-24(2,3)22-21(29)20(23(30)28(22)12-14-5-7-15(25)8-6-14)18-13-36(33,34)19-11-16(27-35(4,31)32)9-10-17(19)26-18/h5-11,20,22,27H,12-13H2,1-4H3/t20?,22-/m1/s1
n/an/a 7n/an/an/an/an/an/a
Roche Palo Alto LLC
Curated by ChEMBL
Assay Description
Inhibition of HSV 1b con1 NS5B polymerase assessed as [3H]UTP incorporation into acid insoluble RNA product
Bioorg Med Chem Lett 19: 5648-51 (2009)
Article DOI: 10.1016/j.bmcl.2009.08.023
BindingDB Entry DOI: 10.7270/Q2T72HJM