BDBM50301911 CHEMBL583269::N-{3-[(S)-5-tert-Butyl-1-(4-fluoro-benzyl)-4-hydroxy-2-oxo-2,5-dihydro-1H-pyrrol-3-yl]-2-chloro-1,1-dioxo-1,4-dihydro-1lambda*6*-benzo[1,4]thiazin-7-yl}-methanesulfonamide
SMILES: CC(C)(C)[C@@H]1N(Cc2ccc(F)cc2)C(=O)C(C1=O)C1=Nc2ccc(NS(C)(=O)=O)cc2S(=O)(=O)C1Cl
InChI Key: InChIKey=DRZUONURAUUYJU-NFOQDIRWSA-N
Data: 1 IC50
Activity Spreadsheet -- Enzyme Inhibition Constant Data from BindingDB
Found 1 hit for monomerid = 50301911
Trg + Lig
Ki
nM
ΔG°
kcal/mole
IC50
nM
Kd
nM
EC50/IC50
nM
koff
s-1
kon
M-1s-1
pHTemp
°C
RNA polymerase (NS5B)
(Hepatitis C virus (HCV))
BDBM50301911
(CHEMBL583269 | N-{3-[(S)-5-tert-Butyl-1-(4-fluoro-...)
Show SMILES CC(C)(C)[C@@H]1N(Cc2ccc(F)cc2)C(=O)C(C1=O)C1=Nc2ccc(NS(C)(=O)=O)cc2S(=O)(=O)C1Cl |r,t:21|
Show InChI InChI=1S/C24H25ClFN3O6S2/c1-24(2,3)21-20(30)18(23(31)29(21)12-13-5-7-14(26)8-6-13)19-22(25)37(34,35)17-11-15(28-36(4,32)33)9-10-16(17)27-19/h5-11,18,21-22,28H,12H2,1-4H3/t18?,21-,22?/m1/s1
n/an/a 2n/an/an/an/an/an/a
Roche Palo Alto LLC
Curated by ChEMBL
Assay Description
Inhibition of HSV 1b con1 NS5B polymerase assessed as [3H]UTP incorporation into acid insoluble RNA product
Bioorg Med Chem Lett 19: 5648-51 (2009)
Article DOI: 10.1016/j.bmcl.2009.08.023
BindingDB Entry DOI: 10.7270/Q2T72HJM