BDBM50302164 3-amino-6-(piperazin-1-yl)-4-propylthieno[2,3-b]pyridine-2-carboxamide::CHEMBL568922
SMILES: CCCc1cc(nc2sc(C(N)=O)c(N)c12)N1CCNCC1
InChI Key: InChIKey=MNHPQFWACBMBQT-UHFFFAOYSA-N
Data: 16 IC50
Activity Spreadsheet -- Enzyme Inhibition Constant Data from BindingDB
Found 16 hits for monomerid = 50302164
Trg + Lig
Ki
nM
ΔG°
kcal/mole
IC50
nM
Kd
nM
EC50/IC50
nM
koff
s-1
kon
M-1s-1
pHTemp
°C
Tyrosine-protein kinase ITK/TSK
(Homo sapiens (Human))
BDBM50302164
(3-amino-6-(piperazin-1-yl)-4-propylthieno[2,3-b]py...)
Show SMILES CCCc1cc(nc2sc(C(N)=O)c(N)c12)N1CCNCC1
Show InChI InChI=1S/C15H21N5OS/c1-2-3-9-8-10(20-6-4-18-5-7-20)19-15-11(9)12(16)13(22-15)14(17)21/h8,18H,2-7,16H2,1H3,(H2,17,21)
Reactome pathway
n/an/a>7.00E+3n/an/an/an/an/an/a
Boehringer Ingelheim Pharmaceuticals
Curated by ChEMBL
Assay Description
Inhibition of Itk
Bioorg Med Chem Lett 19: 5547-51 (2009)
Article DOI: 10.1016/j.bmcl.2009.08.054
BindingDB Entry DOI: 10.7270/Q22Z16G1
Tyrosine-protein kinase BTK
(Homo sapiens (Human))
BDBM50302164
(3-amino-6-(piperazin-1-yl)-4-propylthieno[2,3-b]py...)
Show SMILES CCCc1cc(nc2sc(C(N)=O)c(N)c12)N1CCNCC1
Show InChI InChI=1S/C15H21N5OS/c1-2-3-9-8-10(20-6-4-18-5-7-20)19-15-11(9)12(16)13(22-15)14(17)21/h8,18H,2-7,16H2,1H3,(H2,17,21)
NCI pathway
Reactome pathway
n/an/a>7.00E+3n/an/an/an/an/an/a
Boehringer Ingelheim Pharmaceuticals
Curated by ChEMBL
Assay Description
Inhibition of Btk
Bioorg Med Chem Lett 19: 5547-51 (2009)
Article DOI: 10.1016/j.bmcl.2009.08.054
BindingDB Entry DOI: 10.7270/Q22Z16G1
Epidermal growth factor receptor
(Homo sapiens (Human))
BDBM50302164
(3-amino-6-(piperazin-1-yl)-4-propylthieno[2,3-b]py...)
Show SMILES CCCc1cc(nc2sc(C(N)=O)c(N)c12)N1CCNCC1
Show InChI InChI=1S/C15H21N5OS/c1-2-3-9-8-10(20-6-4-18-5-7-20)19-15-11(9)12(16)13(22-15)14(17)21/h8,18H,2-7,16H2,1H3,(H2,17,21)
n/an/a>7.00E+3n/an/an/an/an/an/a
Boehringer Ingelheim Pharmaceuticals
Curated by ChEMBL
Assay Description
Inhibition of EGFR
Bioorg Med Chem Lett 19: 5547-51 (2009)
Article DOI: 10.1016/j.bmcl.2009.08.054
BindingDB Entry DOI: 10.7270/Q22Z16G1
Fibroblast growth factor receptor 3
(Homo sapiens (Human))
BDBM50302164
(3-amino-6-(piperazin-1-yl)-4-propylthieno[2,3-b]py...)
Show SMILES CCCc1cc(nc2sc(C(N)=O)c(N)c12)N1CCNCC1
Show InChI InChI=1S/C15H21N5OS/c1-2-3-9-8-10(20-6-4-18-5-7-20)19-15-11(9)12(16)13(22-15)14(17)21/h8,18H,2-7,16H2,1H3,(H2,17,21)
Reactome pathway
n/an/a>7.00E+3n/an/an/an/an/an/a
Boehringer Ingelheim Pharmaceuticals
Curated by ChEMBL
Assay Description
Inhibition of FGFR3
Bioorg Med Chem Lett 19: 5547-51 (2009)
Article DOI: 10.1016/j.bmcl.2009.08.054
BindingDB Entry DOI: 10.7270/Q22Z16G1
Ephrin type-A receptor 3 (EPHA3)
(Homo sapiens (Human))
BDBM50302164
(3-amino-6-(piperazin-1-yl)-4-propylthieno[2,3-b]py...)
Show SMILES CCCc1cc(nc2sc(C(N)=O)c(N)c12)N1CCNCC1
Show InChI InChI=1S/C15H21N5OS/c1-2-3-9-8-10(20-6-4-18-5-7-20)19-15-11(9)12(16)13(22-15)14(17)21/h8,18H,2-7,16H2,1H3,(H2,17,21)
Reactome pathway
n/an/a 8.00E+3n/an/an/an/an/an/a
Boehringer Ingelheim Pharmaceuticals
Curated by ChEMBL
Assay Description
Inhibition of Hek
Bioorg Med Chem Lett 19: 5547-51 (2009)
Article DOI: 10.1016/j.bmcl.2009.08.054
BindingDB Entry DOI: 10.7270/Q22Z16G1
Hepatocyte growth factor receptor
(Homo sapiens (Human))
BDBM50302164
(3-amino-6-(piperazin-1-yl)-4-propylthieno[2,3-b]py...)
Show SMILES CCCc1cc(nc2sc(C(N)=O)c(N)c12)N1CCNCC1
Show InChI InChI=1S/C15H21N5OS/c1-2-3-9-8-10(20-6-4-18-5-7-20)19-15-11(9)12(16)13(22-15)14(17)21/h8,18H,2-7,16H2,1H3,(H2,17,21)
n/an/a>7.00E+3n/an/an/an/an/an/a
Boehringer Ingelheim Pharmaceuticals
Curated by ChEMBL
Assay Description
Inhibition of HGFR
Bioorg Med Chem Lett 19: 5547-51 (2009)
Article DOI: 10.1016/j.bmcl.2009.08.054
BindingDB Entry DOI: 10.7270/Q22Z16G1
Insulin-like growth factor I receptor
(Homo sapiens (Human))
BDBM50302164
(3-amino-6-(piperazin-1-yl)-4-propylthieno[2,3-b]py...)
Show SMILES CCCc1cc(nc2sc(C(N)=O)c(N)c12)N1CCNCC1
Show InChI InChI=1S/C15H21N5OS/c1-2-3-9-8-10(20-6-4-18-5-7-20)19-15-11(9)12(16)13(22-15)14(17)21/h8,18H,2-7,16H2,1H3,(H2,17,21)
Reactome pathway
n/an/a>7.00E+3n/an/an/an/an/an/a
Boehringer Ingelheim Pharmaceuticals
Curated by ChEMBL
Assay Description
Inhibition of IGF1R
Bioorg Med Chem Lett 19: 5547-51 (2009)
Article DOI: 10.1016/j.bmcl.2009.08.054
BindingDB Entry DOI: 10.7270/Q22Z16G1
Insulin receptor
(Homo sapiens (Human))
BDBM50302164
(3-amino-6-(piperazin-1-yl)-4-propylthieno[2,3-b]py...)
Show SMILES CCCc1cc(nc2sc(C(N)=O)c(N)c12)N1CCNCC1
Show InChI InChI=1S/C15H21N5OS/c1-2-3-9-8-10(20-6-4-18-5-7-20)19-15-11(9)12(16)13(22-15)14(17)21/h8,18H,2-7,16H2,1H3,(H2,17,21)
n/an/a>7.00E+3n/an/an/an/an/an/a
Boehringer Ingelheim Pharmaceuticals
Curated by ChEMBL
Assay Description
Inhibition of IR
Bioorg Med Chem Lett 19: 5547-51 (2009)
Article DOI: 10.1016/j.bmcl.2009.08.054
BindingDB Entry DOI: 10.7270/Q22Z16G1
Inhibitor of nuclear factor kappa-B kinase subunit alpha
(Homo sapiens (Human))
BDBM50302164
(3-amino-6-(piperazin-1-yl)-4-propylthieno[2,3-b]py...)
Show SMILES CCCc1cc(nc2sc(C(N)=O)c(N)c12)N1CCNCC1
Show InChI InChI=1S/C15H21N5OS/c1-2-3-9-8-10(20-6-4-18-5-7-20)19-15-11(9)12(16)13(22-15)14(17)21/h8,18H,2-7,16H2,1H3,(H2,17,21)
Reactome pathway
n/an/a 3.40E+3n/an/an/an/an/an/a
Boehringer Ingelheim Pharmaceuticals
Curated by ChEMBL
Assay Description
Inhibition of IKKalpha
Bioorg Med Chem Lett 19: 5547-51 (2009)
Article DOI: 10.1016/j.bmcl.2009.08.054
BindingDB Entry DOI: 10.7270/Q22Z16G1
Inhibitor of nuclear factor kappa-B kinase subunit beta
(Homo sapiens (Human))
BDBM50302164
(3-amino-6-(piperazin-1-yl)-4-propylthieno[2,3-b]py...)
Show SMILES CCCc1cc(nc2sc(C(N)=O)c(N)c12)N1CCNCC1
Show InChI InChI=1S/C15H21N5OS/c1-2-3-9-8-10(20-6-4-18-5-7-20)19-15-11(9)12(16)13(22-15)14(17)21/h8,18H,2-7,16H2,1H3,(H2,17,21)
NCI pathway
Reactome pathway
n/an/a 120n/an/an/an/an/an/a
Boehringer Ingelheim Pharmaceuticals
Curated by ChEMBL
Assay Description
Inhibition of Flag epitope-tagged IKK-beta preincubated for 5 mins by scintillation proximity assay
Bioorg Med Chem Lett 19: 5547-51 (2009)
Article DOI: 10.1016/j.bmcl.2009.08.054
BindingDB Entry DOI: 10.7270/Q22Z16G1
Tyrosine-protein kinase Lyn
(Homo sapiens (Human))
BDBM50302164
(3-amino-6-(piperazin-1-yl)-4-propylthieno[2,3-b]py...)
Show SMILES CCCc1cc(nc2sc(C(N)=O)c(N)c12)N1CCNCC1
Show InChI InChI=1S/C15H21N5OS/c1-2-3-9-8-10(20-6-4-18-5-7-20)19-15-11(9)12(16)13(22-15)14(17)21/h8,18H,2-7,16H2,1H3,(H2,17,21)
Reactome pathway
n/an/a>7.00E+3n/an/an/an/an/an/a
Boehringer Ingelheim Pharmaceuticals
Curated by ChEMBL
Assay Description
Inhibition of Lyn
Bioorg Med Chem Lett 19: 5547-51 (2009)
Article DOI: 10.1016/j.bmcl.2009.08.054
BindingDB Entry DOI: 10.7270/Q22Z16G1
Platelet-derived growth factor receptor alpha
(Homo sapiens (Human))
BDBM50302164
(3-amino-6-(piperazin-1-yl)-4-propylthieno[2,3-b]py...)
Show SMILES CCCc1cc(nc2sc(C(N)=O)c(N)c12)N1CCNCC1
Show InChI InChI=1S/C15H21N5OS/c1-2-3-9-8-10(20-6-4-18-5-7-20)19-15-11(9)12(16)13(22-15)14(17)21/h8,18H,2-7,16H2,1H3,(H2,17,21)
n/an/a 300n/an/an/an/an/an/a
Boehringer Ingelheim Pharmaceuticals
Curated by ChEMBL
Assay Description
Inhibition of PDGFRalpha
Bioorg Med Chem Lett 19: 5547-51 (2009)
Article DOI: 10.1016/j.bmcl.2009.08.054
BindingDB Entry DOI: 10.7270/Q22Z16G1
Tyrosine-protein kinase SYK
(Homo sapiens (Human))
BDBM50302164
(3-amino-6-(piperazin-1-yl)-4-propylthieno[2,3-b]py...)
Show SMILES CCCc1cc(nc2sc(C(N)=O)c(N)c12)N1CCNCC1
Show InChI InChI=1S/C15H21N5OS/c1-2-3-9-8-10(20-6-4-18-5-7-20)19-15-11(9)12(16)13(22-15)14(17)21/h8,18H,2-7,16H2,1H3,(H2,17,21)
NCI pathway
Reactome pathway
n/an/a>7.00E+3n/an/an/an/an/an/a
Boehringer Ingelheim Pharmaceuticals
Curated by ChEMBL
Assay Description
Inhibition of Syk
Bioorg Med Chem Lett 19: 5547-51 (2009)
Article DOI: 10.1016/j.bmcl.2009.08.054
BindingDB Entry DOI: 10.7270/Q22Z16G1
High affinity nerve growth factor receptor
(Homo sapiens (Human))
BDBM50302164
(3-amino-6-(piperazin-1-yl)-4-propylthieno[2,3-b]py...)
Show SMILES CCCc1cc(nc2sc(C(N)=O)c(N)c12)N1CCNCC1
Show InChI InChI=1S/C15H21N5OS/c1-2-3-9-8-10(20-6-4-18-5-7-20)19-15-11(9)12(16)13(22-15)14(17)21/h8,18H,2-7,16H2,1H3,(H2,17,21)
n/an/a>7.00E+3n/an/an/an/an/an/a
Boehringer Ingelheim Pharmaceuticals
Curated by ChEMBL
Assay Description
Inhibition of TrkA
Bioorg Med Chem Lett 19: 5547-51 (2009)
Article DOI: 10.1016/j.bmcl.2009.08.054
BindingDB Entry DOI: 10.7270/Q22Z16G1
Vascular endothelial growth factor receptor 1
(Homo sapiens (Human))
BDBM50302164
(3-amino-6-(piperazin-1-yl)-4-propylthieno[2,3-b]py...)
Show SMILES CCCc1cc(nc2sc(C(N)=O)c(N)c12)N1CCNCC1
Show InChI InChI=1S/C15H21N5OS/c1-2-3-9-8-10(20-6-4-18-5-7-20)19-15-11(9)12(16)13(22-15)14(17)21/h8,18H,2-7,16H2,1H3,(H2,17,21)
n/an/a>7.00E+3n/an/an/an/an/an/a
Boehringer Ingelheim Pharmaceuticals
Curated by ChEMBL
Assay Description
Inhibition of VEGFR1
Bioorg Med Chem Lett 19: 5547-51 (2009)
Article DOI: 10.1016/j.bmcl.2009.08.054
BindingDB Entry DOI: 10.7270/Q22Z16G1
Ephrin type-A receptor 2
(Homo sapiens (Human))
BDBM50302164
(3-amino-6-(piperazin-1-yl)-4-propylthieno[2,3-b]py...)
Show SMILES CCCc1cc(nc2sc(C(N)=O)c(N)c12)N1CCNCC1
Show InChI InChI=1S/C15H21N5OS/c1-2-3-9-8-10(20-6-4-18-5-7-20)19-15-11(9)12(16)13(22-15)14(17)21/h8,18H,2-7,16H2,1H3,(H2,17,21)
NCI pathway
Reactome pathway
n/an/a>7.00E+3n/an/an/an/an/an/a
Boehringer Ingelheim Pharmaceuticals
Curated by ChEMBL
Assay Description
Inhibition of Eck
Bioorg Med Chem Lett 19: 5547-51 (2009)
Article DOI: 10.1016/j.bmcl.2009.08.054
BindingDB Entry DOI: 10.7270/Q22Z16G1