BDBM50302170 (R)-3-amino-6-(3-aminopyrrolidin-1-yl)-4-propylthieno[2,3-b]pyridine-2-carboxamide::CHEMBL579008
SMILES: CCCc1cc(nc2sc(C(N)=O)c(N)c12)N1CC[C@@H](N)C1
InChI Key: InChIKey=BKBLUMRHFSUZKV-SECBINFHSA-N
Data: 1 IC50
Activity Spreadsheet -- Enzyme Inhibition Constant Data from BindingDB
Found 1 hit for monomerid = 50302170
Trg + Lig
Ki
nM
ΔG°
kcal/mole
IC50
nM
Kd
nM
EC50/IC50
nM
koff
s-1
kon
M-1s-1
pHTemp
°C
Inhibitor of nuclear factor kappa-B kinase subunit beta
(Homo sapiens (Human))
BDBM50302170
((R)-3-amino-6-(3-aminopyrrolidin-1-yl)-4-propylthi...)
Show SMILES CCCc1cc(nc2sc(C(N)=O)c(N)c12)N1CC[C@@H](N)C1 |r|
Show InChI InChI=1S/C15H21N5OS/c1-2-3-8-6-10(20-5-4-9(16)7-20)19-15-11(8)12(17)13(22-15)14(18)21/h6,9H,2-5,7,16-17H2,1H3,(H2,18,21)/t9-/m1/s1
NCI pathway
Reactome pathway
n/an/a 500n/an/an/an/an/an/a
Boehringer Ingelheim Pharmaceuticals
Curated by ChEMBL
Assay Description
Inhibition of Flag epitope-tagged IKK-beta preincubated for 5 mins by scintillation proximity assay
Bioorg Med Chem Lett 19: 5547-51 (2009)
Article DOI: 10.1016/j.bmcl.2009.08.054
BindingDB Entry DOI: 10.7270/Q22Z16G1