BDBM50302187 3-amino-4-methyl-6-morpholinothieno[2,3-b]pyridine-2-carboxamide::CHEMBL570699
SMILES: Cc1cc(nc2sc(C(N)=O)c(N)c12)N1CCOCC1
InChI Key: InChIKey=FVKUOJZYVICQNN-UHFFFAOYSA-N
Data: 1 IC50
Activity Spreadsheet -- Enzyme Inhibition Constant Data from BindingDB
Found 1 hit for monomerid = 50302187
Trg + Lig
Ki
nM
ΔG°
kcal/mole
IC50
nM
Kd
nM
EC50/IC50
nM
koff
s-1
kon
M-1s-1
pHTemp
°C
Inhibitor of nuclear factor kappa-B kinase subunit beta
(Homo sapiens (Human))
BDBM50302187
(3-amino-4-methyl-6-morpholinothieno[2,3-b]pyridine...)
Show SMILES Cc1cc(nc2sc(C(N)=O)c(N)c12)N1CCOCC1
Show InChI InChI=1S/C13H16N4O2S/c1-7-6-8(17-2-4-19-5-3-17)16-13-9(7)10(14)11(20-13)12(15)18/h6H,2-5,14H2,1H3,(H2,15,18)
NCI pathway
Reactome pathway
n/an/a 2.50E+3n/an/an/an/an/an/a
Boehringer Ingelheim Pharmaceuticals
Curated by ChEMBL
Assay Description
Inhibition of Flag epitope-tagged IKK-beta preincubated for 5 mins by scintillation proximity assay
Bioorg Med Chem Lett 19: 5547-51 (2009)
Article DOI: 10.1016/j.bmcl.2009.08.054
BindingDB Entry DOI: 10.7270/Q22Z16G1