BDBM50302200 3-amino-6-methyl-4-(thiophen-2-yl)thieno[2,3-b]pyridine-2-carboxamide::CHEMBL569330
SMILES: Cc1cc(-c2cccs2)c2c(N)c(sc2n1)C(N)=O
InChI Key: InChIKey=AXFTYCQBICPJFF-UHFFFAOYSA-N
Data: 1 IC50
Activity Spreadsheet -- Enzyme Inhibition Constant Data from BindingDB
Found 1 hit for monomerid = 50302200
Trg + Lig
Ki
nM
ΔG°
kcal/mole
IC50
nM
Kd
nM
EC50/IC50
nM
koff
s-1
kon
M-1s-1
pHTemp
°C
Inhibitor of nuclear factor kappa-B kinase subunit beta
(Homo sapiens (Human))
BDBM50302200
(3-amino-6-methyl-4-(thiophen-2-yl)thieno[2,3-b]pyr...)
Show SMILES Cc1cc(-c2cccs2)c2c(N)c(sc2n1)C(N)=O
Show InChI InChI=1S/C13H11N3OS2/c1-6-5-7(8-3-2-4-18-8)9-10(14)11(12(15)17)19-13(9)16-6/h2-5H,14H2,1H3,(H2,15,17)
NCI pathway
Reactome pathway
n/an/a 2.00E+3n/an/an/an/an/an/a
Boehringer Ingelheim Pharmaceuticals
Curated by ChEMBL
Assay Description
Inhibition of Flag epitope-tagged IKK-beta preincubated for 5 mins by scintillation proximity assay
Bioorg Med Chem Lett 19: 5547-51 (2009)
Article DOI: 10.1016/j.bmcl.2009.08.054
BindingDB Entry DOI: 10.7270/Q22Z16G1