BDBM50302397 3-(3,5-diethyl-1H-pyrazol-4-yloxy)-5-chlorobenzonitrile::CHEMBL567916
SMILES: CCc1n[nH]c(CC)c1Oc1cc(Cl)cc(c1)C#N
InChI Key: InChIKey=SDECLXAHXDUCCV-UHFFFAOYSA-N
Data: 1 IC50
Activity Spreadsheet -- Enzyme Inhibition Constant Data from BindingDB
Found 1 hit for monomerid = 50302397
Trg + Lig
Ki
nM
ΔG°
kcal/mole
IC50
nM
Kd
nM
EC50/IC50
nM
koff
s-1
kon
M-1s-1
pHTemp
°C
Potassium voltage-gated channel subfamily H member 2
(Homo sapiens (Human))
BDBM50302397
(3-(3,5-diethyl-1H-pyrazol-4-yloxy)-5-chlorobenzoni...)
Show SMILES CCc1n[nH]c(CC)c1Oc1cc(Cl)cc(c1)C#N
Show InChI InChI=1S/C14H14ClN3O/c1-3-12-14(13(4-2)18-17-12)19-11-6-9(8-16)5-10(15)7-11/h5-7H,3-4H2,1-2H3,(H,17,18)
Reactome pathway
n/an/a 3.90E+4n/an/an/an/an/an/a
Pfizer Global Research and Development
Curated by ChEMBL
Assay Description
Displacement of [3H]dofetilide from human ERG expressed in HEK293 cells
Bioorg Med Chem Lett 19: 5857-60 (2009)
Article DOI: 10.1016/j.bmcl.2009.08.080
BindingDB Entry DOI: 10.7270/Q2R78F8V