BDBM50302430 2-(9-(2-hydroxy-2-methylpropyl)-6-isobutoxy-1H-phenanthro[9,10-d]imidazol-2-yl)isophthalonitrile::CHEMBL565617
SMILES: CC(C)COc1ccc2c3[nH]c(nc3c3ccc(CC(C)(C)O)cc3c2c1)-c1c(cccc1C#N)C#N
InChI Key: InChIKey=VGJUAMQHMGNVNK-UHFFFAOYSA-N
Data: 1 IC50
Activity Spreadsheet -- Enzyme Inhibition Constant Data from BindingDB
Found 1 hit for monomerid = 50302430
Trg + Lig
Ki
nM
ΔG°
kcal/mole
IC50
nM
Kd
nM
EC50/IC50
nM
koff
s-1
kon
M-1s-1
pHTemp
°C
Prostaglandin E synthase
(Homo sapiens (Human))
BDBM50302430
(2-(9-(2-hydroxy-2-methylpropyl)-6-isobutoxy-1H-phe...)
Show SMILES CC(C)COc1ccc2c3[nH]c(nc3c3ccc(CC(C)(C)O)cc3c2c1)-c1c(cccc1C#N)C#N
Show InChI InChI=1S/C31H28N4O2/c1-18(2)17-37-22-9-11-24-26(13-22)25-12-19(14-31(3,4)36)8-10-23(25)28-29(24)35-30(34-28)27-20(15-32)6-5-7-21(27)16-33/h5-13,18,36H,14,17H2,1-4H3,(H,34,35)
Reactome pathway
n/an/a 3n/an/an/an/an/an/a
Merck Frosst Centre for Therapeutic Research
Curated by ChEMBL
Assay Description
Displacement of [3H]PGH2 from human recombinant PGES1 expressed in CHOK1 cells
Bioorg Med Chem Lett 19: 5837-41 (2009)
Article DOI: 10.1016/j.bmcl.2009.08.085
BindingDB Entry DOI: 10.7270/Q2MG7PKK