BDBM50302519 4-(7-chloro-4-methyl-1H-indol-5-ylamino)-5-styrylnicotinonitrile::CHEMBL568687
SMILES: Cc1c(Nc2c(\C=C\c3ccccc3)cncc2C#N)cc(Cl)c2[nH]ccc12
InChI Key: InChIKey=QEQRMPXQCBZMSU-BQYQJAHWSA-N
Data: 2 IC50
Activity Spreadsheet -- Enzyme Inhibition Constant Data from BindingDB
Found 2 hits for monomerid = 50302519
Trg + Lig
Ki
nM
ΔG°
kcal/mole
IC50
nM
Kd
nM
EC50/IC50
nM
koff
s-1
kon
M-1s-1
pHTemp
°C
Protein kinase C delta type
(Homo sapiens (Human))
BDBM50302519
(4-(7-chloro-4-methyl-1H-indol-5-ylamino)-5-styryln...)
Show SMILES Cc1c(Nc2c(\C=C\c3ccccc3)cncc2C#N)cc(Cl)c2[nH]ccc12
Show InChI InChI=1S/C23H17ClN4/c1-15-19-9-10-27-23(19)20(24)11-21(15)28-22-17(13-26-14-18(22)12-25)8-7-16-5-3-2-4-6-16/h2-11,13-14,27H,1H3,(H,26,28)/b8-7+
NCI pathway
Reactome pathway
n/an/a 880n/an/an/an/an/an/a
Wyeth Research
Curated by ChEMBL
Assay Description
Inhibition of PKCdelta by IMAP kinase assay
Bioorg Med Chem Lett 19: 5829-32 (2009)
Article DOI: 10.1016/j.bmcl.2009.08.086
BindingDB Entry DOI: 10.7270/Q2ZS2WKC
Protein kinase C theta type
(Homo sapiens (Human))
BDBM50302519
(4-(7-chloro-4-methyl-1H-indol-5-ylamino)-5-styryln...)
Show SMILES Cc1c(Nc2c(\C=C\c3ccccc3)cncc2C#N)cc(Cl)c2[nH]ccc12
Show InChI InChI=1S/C23H17ClN4/c1-15-19-9-10-27-23(19)20(24)11-21(15)28-22-17(13-26-14-18(22)12-25)8-7-16-5-3-2-4-6-16/h2-11,13-14,27H,1H3,(H,26,28)/b8-7+
NCI pathway
Reactome pathway
n/an/a 77n/an/an/an/an/an/a
Wyeth Research
Curated by ChEMBL
Assay Description
Inhibition of human PKCtheta by IMAP kinase assay
Bioorg Med Chem Lett 19: 5829-32 (2009)
Article DOI: 10.1016/j.bmcl.2009.08.086
BindingDB Entry DOI: 10.7270/Q2ZS2WKC