BDBM50302610 (2R,3S,4S,5R)-2-(4-Chloro-3-(4-ethoxybenzyl)phenyl)-6-methoxytetrahydro-2H-pyran-3,4,5-triol::CHEMBL582979
SMILES: CCOc1ccc(Cc2cc(ccc2Cl)[C@H]2OC(OC)[C@H](O)[C@@H](O)[C@@H]2O)cc1
InChI Key: InChIKey=XEEROTCYZVZEEI-PPSGHYAZSA-N
Data: 2 IC50
Activity Spreadsheet -- Enzyme Inhibition Constant Data from BindingDB
Found 2 hits for monomerid = 50302610
Trg + Lig
Ki
nM
ΔG°
kcal/mole
IC50
nM
Kd
nM
EC50/IC50
nM
koff
s-1
kon
M-1s-1
pHTemp
°C
sodium-dependent glucose cotransporter 2 (SGLT2)
(Mus musculus (Mouse))
BDBM50302610
((2R,3S,4S,5R)-2-(4-Chloro-3-(4-ethoxybenzyl)phenyl...)
Show SMILES CCOc1ccc(Cc2cc(ccc2Cl)[C@H]2OC(OC)[C@H](O)[C@@H](O)[C@@H]2O)cc1 |r|
Show InChI InChI=1S/C21H25ClO6/c1-3-27-15-7-4-12(5-8-15)10-14-11-13(6-9-16(14)22)20-18(24)17(23)19(25)21(26-2)28-20/h4-9,11,17-21,23-25H,3,10H2,1-2H3/t17-,18-,19+,20+,21?/m0/s1
Reactome pathway
n/an/a 9.20E+3n/an/an/an/an/an/a
Princ
Curated by ChEMBL
Assay Description
Inhibition of mouse SGLT2-mediated [14C]alpha-methylglucopyranoside uptake by cell based assay
J Med Chem 52: 6201-4 (2009)
Article DOI: 10.1021/jm900951n
BindingDB Entry DOI: 10.7270/Q2F76DH1
Sodium/glucose cotransporter 2
(Homo sapiens (Human))
BDBM50302610
((2R,3S,4S,5R)-2-(4-Chloro-3-(4-ethoxybenzyl)phenyl...)
Show SMILES CCOc1ccc(Cc2cc(ccc2Cl)[C@H]2OC(OC)[C@H](O)[C@@H](O)[C@@H]2O)cc1 |r|
Show InChI InChI=1S/C21H25ClO6/c1-3-27-15-7-4-12(5-8-15)10-14-11-13(6-9-16(14)22)20-18(24)17(23)19(25)21(26-2)28-20/h4-9,11,17-21,23-25H,3,10H2,1-2H3/t17-,18-,19+,20+,21?/m0/s1
n/an/a>3.00E+4n/an/an/an/an/an/a
Princ
Curated by ChEMBL
Assay Description
Inhibition of human SGLT2 expressed in HEK293 cells assessed as inhibition of [14C]alpha-methylglucopyranoside uptake
J Med Chem 52: 6201-4 (2009)
Article DOI: 10.1021/jm900951n
BindingDB Entry DOI: 10.7270/Q2F76DH1