BDBM50303047 (S)-3-(1-(5-fluoropyridin-2-yl)ethoxy)-6-methyl-5-(5-methyl-1H-pyrazol-3-ylamino)pyrazine-2-carbonitrile::CHEMBL570192
SMILES: C[C@H](Oc1nc(Nc2cc(C)n[nH]2)c(C)nc1C#N)c1ccc(F)cn1
InChI Key: InChIKey=NUUZIPNBPALDNV-NSHDSACASA-N
Data: 3 IC50
Activity Spreadsheet -- Enzyme Inhibition Constant Data from BindingDB
Found 3 hits for monomerid = 50303047
Trg + Lig
Ki
nM
ΔG°
kcal/mole
IC50
nM
Kd
nM
EC50/IC50
nM
koff
s-1
kon
M-1s-1
pHTemp
°C
Tyrosine-protein kinase JAK2
(Homo sapiens (Human))
BDBM50303047
((S)-3-(1-(5-fluoropyridin-2-yl)ethoxy)-6-methyl-5-...)
Show SMILES C[C@H](Oc1nc(Nc2cc(C)n[nH]2)c(C)nc1C#N)c1ccc(F)cn1 |r|
Show InChI InChI=1S/C17H16FN7O/c1-9-6-15(25-24-9)22-16-10(2)21-14(7-19)17(23-16)26-11(3)13-5-4-12(18)8-20-13/h4-6,8,11H,1-3H3,(H2,22,23,24,25)/t11-/m0/s1
Reactome pathway
n/an/a 142n/an/an/an/an/an/a
AstraZeneca R&D Boston
Curated by ChEMBL
Assay Description
Inhibition of JAK2 using 5 mM ATP as a substrate
Bioorg Med Chem Lett 19: 6524-8 (2009)
Article DOI: 10.1016/j.bmcl.2009.10.054
BindingDB Entry DOI: 10.7270/Q2CV4HT4
Tyrosine-protein kinase JAK3
(Homo sapiens (Human))
BDBM50303047
((S)-3-(1-(5-fluoropyridin-2-yl)ethoxy)-6-methyl-5-...)
Show SMILES C[C@H](Oc1nc(Nc2cc(C)n[nH]2)c(C)nc1C#N)c1ccc(F)cn1 |r|
Show InChI InChI=1S/C17H16FN7O/c1-9-6-15(25-24-9)22-16-10(2)21-14(7-19)17(23-16)26-11(3)13-5-4-12(18)8-20-13/h4-6,8,11H,1-3H3,(H2,22,23,24,25)/t11-/m0/s1
Reactome pathway
n/an/a>3.00E+4n/an/an/an/an/an/a
AstraZeneca R&D Boston
Curated by ChEMBL
Assay Description
Inhibition of JAK3 using 5 mM ATP as a substrate
Bioorg Med Chem Lett 19: 6524-8 (2009)
Article DOI: 10.1016/j.bmcl.2009.10.054
BindingDB Entry DOI: 10.7270/Q2CV4HT4
Tyrosine-protein kinase JAK2
(Homo sapiens (Human))
BDBM50303047
((S)-3-(1-(5-fluoropyridin-2-yl)ethoxy)-6-methyl-5-...)
Show SMILES C[C@H](Oc1nc(Nc2cc(C)n[nH]2)c(C)nc1C#N)c1ccc(F)cn1 |r|
Show InChI InChI=1S/C17H16FN7O/c1-9-6-15(25-24-9)22-16-10(2)21-14(7-19)17(23-16)26-11(3)13-5-4-12(18)8-20-13/h4-6,8,11H,1-3H3,(H2,22,23,24,25)/t11-/m0/s1
Reactome pathway
n/an/a 4n/an/an/an/an/an/a
AstraZeneca R&D Boston
Curated by ChEMBL
Assay Description
Inhibition of JAK2 using 2 mM ATP as a substrate
Bioorg Med Chem Lett 19: 6524-8 (2009)
Article DOI: 10.1016/j.bmcl.2009.10.054
BindingDB Entry DOI: 10.7270/Q2CV4HT4