BDBM50303056 1-(6-(2-aminopyrazolo[1,5-a]pyrimidin-3-yl)pyrimidin-4-yl)-N-ethyl-N-(2,2,2-trifluoroethyl)piperidine-3-carboxamide::CHEMBL569092
SMILES: CCN(CC(F)(F)F)C(=O)C1CCCN(C1)c1cc(ncn1)-c1c(N)nn2cccnc12
InChI Key: InChIKey=YQIGPSHQXOMOQQ-UHFFFAOYSA-N
Data: 3 IC50
Activity Spreadsheet -- Enzyme Inhibition Constant Data from BindingDB
Found 3 hits for monomerid = 50303056
Trg + Lig
Ki
nM
ΔG°
kcal/mole
IC50
nM
Kd
nM
EC50/IC50
nM
koff
s-1
kon
M-1s-1
pHTemp
°C
Tyrosine-protein kinase JAK2
(Homo sapiens (Human))
BDBM50303056
(1-(6-(2-aminopyrazolo[1,5-a]pyrimidin-3-yl)pyrimid...)
Show SMILES CCN(CC(F)(F)F)C(=O)C1CCCN(C1)c1cc(ncn1)-c1c(N)nn2cccnc12
Show InChI InChI=1S/C20H23F3N8O/c1-2-29(11-20(21,22)23)19(32)13-5-3-7-30(10-13)15-9-14(26-12-27-15)16-17(24)28-31-8-4-6-25-18(16)31/h4,6,8-9,12-13H,2-3,5,7,10-11H2,1H3,(H2,24,28)
Reactome pathway
n/an/a 4n/an/an/an/an/an/a
Vertex Pharmaceuticals Inc
Curated by ChEMBL
Assay Description
Inhibition of JAK2 by radiometric assay
Bioorg Med Chem Lett 19: 6529-33 (2009)
Article DOI: 10.1016/j.bmcl.2009.10.053
BindingDB Entry DOI: 10.7270/Q2SJ1MKQ
Tyrosine-protein kinase JAK2
(Homo sapiens (Human))
BDBM50303056
(1-(6-(2-aminopyrazolo[1,5-a]pyrimidin-3-yl)pyrimid...)
Show SMILES CCN(CC(F)(F)F)C(=O)C1CCCN(C1)c1cc(ncn1)-c1c(N)nn2cccnc12
Show InChI InChI=1S/C20H23F3N8O/c1-2-29(11-20(21,22)23)19(32)13-5-3-7-30(10-13)15-9-14(26-12-27-15)16-17(24)28-31-8-4-6-25-18(16)31/h4,6,8-9,12-13H,2-3,5,7,10-11H2,1H3,(H2,24,28)
Reactome pathway
n/an/a 1.30E+3n/an/an/an/an/an/a
Vertex Pharmaceuticals Inc
Curated by ChEMBL
Assay Description
Inhibition of JAK2-mediated STAT5 phosphorylation in GMCSF-stimulated human TF1 cells
Bioorg Med Chem Lett 19: 6529-33 (2009)
Article DOI: 10.1016/j.bmcl.2009.10.053
BindingDB Entry DOI: 10.7270/Q2SJ1MKQ
Tyrosine-protein kinase JAK3
(Homo sapiens (Human))
BDBM50303056
(1-(6-(2-aminopyrazolo[1,5-a]pyrimidin-3-yl)pyrimid...)
Show SMILES CCN(CC(F)(F)F)C(=O)C1CCCN(C1)c1cc(ncn1)-c1c(N)nn2cccnc12
Show InChI InChI=1S/C20H23F3N8O/c1-2-29(11-20(21,22)23)19(32)13-5-3-7-30(10-13)15-9-14(26-12-27-15)16-17(24)28-31-8-4-6-25-18(16)31/h4,6,8-9,12-13H,2-3,5,7,10-11H2,1H3,(H2,24,28)
Reactome pathway
n/an/a 170n/an/an/an/an/an/a
Vertex Pharmaceuticals Inc
Curated by ChEMBL
Assay Description
Inhibition of JAK3 by radiometric assay
Bioorg Med Chem Lett 19: 6529-33 (2009)
Article DOI: 10.1016/j.bmcl.2009.10.053
BindingDB Entry DOI: 10.7270/Q2SJ1MKQ