BDBM50303093 CHEMBL584739::ethyl 3-(3-(4-chloro-3-methoxyphenyl)-2-(pyridin-4-yl)-1,2-dihydropyrazolo[1,5-a]pyrimidin-7-yl)-8-azabicyclo[3.2.1]octane-8-carboxylate
SMILES: CCOC(=O)N1C2CCC1CC(C2)c1ccnc2c(c(nn12)-c1ccncc1)-c1ccc(Cl)c(OC)c1
InChI Key: InChIKey=ZRFVXMOLTJFMLY-UHFFFAOYSA-N
Data: 1 IC50
Activity Spreadsheet -- Enzyme Inhibition Constant Data from BindingDB
Found 1 hit for monomerid = 50303093
Trg + Lig
Ki
nM
ΔG°
kcal/mole
IC50
nM
Kd
nM
EC50/IC50
nM
koff
s-1
kon
M-1s-1
pHTemp
°C
Serine/threonine-protein kinase B-raf
(Homo sapiens (Human))
BDBM50303093
(CHEMBL584739 | ethyl 3-(3-(4-chloro-3-methoxypheny...)
Show SMILES CCOC(=O)N1C2CCC1CC(C2)c1ccnc2c(c(nn12)-c1ccncc1)-c1ccc(Cl)c(OC)c1 |THB:13:11:5:7.8|
Show InChI InChI=1S/C28H28ClN5O3/c1-3-37-28(35)33-20-5-6-21(33)15-19(14-20)23-10-13-31-27-25(18-4-7-22(29)24(16-18)36-2)26(32-34(23)27)17-8-11-30-12-9-17/h4,7-13,16,19-21H,3,5-6,14-15H2,1-2H3
NCI pathway
Reactome pathway
n/an/a 54.1n/an/an/an/an/an/a
Wyeth Research
Curated by ChEMBL
Assay Description
Inhibition of B-Raf
Bioorg Med Chem Lett 19: 6957-61 (2009)
Article DOI: 10.1016/j.bmcl.2009.10.058
BindingDB Entry DOI: 10.7270/Q2833S34