BDBM50303544 (1-(2-(Pyridin-4-yl)ethyl)-1H-indol-3-yl)(2,2,3,3-tetramethylcyclopropyl)methanone::CHEMBL569524
SMILES: CC1(C)C(C(=O)c2cn(CCc3ccncc3)c3ccccc23)C1(C)C
InChI Key: InChIKey=VJRKAFPJRKTWQV-UHFFFAOYSA-N
Data: 2 KI  1 EC50
Activity Spreadsheet -- Enzyme Inhibition Constant Data from BindingDB
Found 3 hits for monomerid = 50303544
Trg + Lig
Ki
nM
ΔG°
kcal/mole
IC50
nM
Kd
nM
EC50/IC50
nM
koff
s-1
kon
M-1s-1
pHTemp
°C
Cannabinoid receptor 2
(Homo sapiens (Human))
BDBM50303544
((1-(2-(Pyridin-4-yl)ethyl)-1H-indol-3-yl)(2,2,3,3-...)
Show SMILES CC1(C)C(C(=O)c2cn(CCc3ccncc3)c3ccccc23)C1(C)C
Show InChI InChI=1S/C23H26N2O/c1-22(2)21(23(22,3)4)20(26)18-15-25(19-8-6-5-7-17(18)19)14-11-16-9-12-24-13-10-16/h5-10,12-13,15,21H,11,14H2,1-4H3
Reactome pathway
31n/an/an/an/an/an/an/an/a
Abbott Laboratories
Curated by ChEMBL
Assay Description
Displacement of [3H]CP-55940 from human recombinant CB2 receptor expressed in HEK293 cells
J Med Chem 53: 295-315 (2010)
Article DOI: 10.1021/jm901214q
BindingDB Entry DOI: 10.7270/Q2KD1Z00
Cannabinoid receptor 1
(Homo sapiens (Human))
BDBM50303544
((1-(2-(Pyridin-4-yl)ethyl)-1H-indol-3-yl)(2,2,3,3-...)
Show SMILES CC1(C)C(C(=O)c2cn(CCc3ccncc3)c3ccccc23)C1(C)C
Show InChI InChI=1S/C23H26N2O/c1-22(2)21(23(22,3)4)20(26)18-15-25(19-8-6-5-7-17(18)19)14-11-16-9-12-24-13-10-16/h5-10,12-13,15,21H,11,14H2,1-4H3
NCI pathway
Reactome pathway
2.20E+3n/an/an/an/an/an/an/an/a
Abbott Laboratories
Curated by ChEMBL
Assay Description
Displacement of [3H]CP-55940 from human recombinant CB1 receptor expressed in CHO cells
J Med Chem 53: 295-315 (2010)
Article DOI: 10.1021/jm901214q
BindingDB Entry DOI: 10.7270/Q2KD1Z00
Cannabinoid receptor 2
(Homo sapiens (Human))
BDBM50303544
((1-(2-(Pyridin-4-yl)ethyl)-1H-indol-3-yl)(2,2,3,3-...)
Show SMILES CC1(C)C(C(=O)c2cn(CCc3ccncc3)c3ccccc23)C1(C)C
Show InChI InChI=1S/C23H26N2O/c1-22(2)21(23(22,3)4)20(26)18-15-25(19-8-6-5-7-17(18)19)14-11-16-9-12-24-13-10-16/h5-10,12-13,15,21H,11,14H2,1-4H3
Reactome pathway
n/an/an/an/a 162n/an/an/an/a
Abbott Laboratories
Curated by ChEMBL
Assay Description
Agonist activity at human recombinant CB2 receptor expressed in HEK293 cells coexpressing Galphaq/o5 assessed as calcium mobilization by FLIPR assay
J Med Chem 53: 295-315 (2010)
Article DOI: 10.1021/jm901214q
BindingDB Entry DOI: 10.7270/Q2KD1Z00