BDBM50303806 4-((S)-1-((5aR,6S)-1-(4-fluorophenyl)-5a-methyl-5,5a,6,7,8,9-hexahydroimidazo[1,5-b]isoquinolin-6-yl)-1-hydroxyethyl)benzonitrile::CHEMBL572357
SMILES: C[C@](O)([C@H]1CCCC2=Cc3c(ncn3C[C@]12C)-c1ccc(F)cc1)c1ccc(cc1)C#N
InChI Key: InChIKey=IENLGDURJWOKSY-DOEKTCAHSA-N
Data: 1 KI  1 IC50  3 EC50
Activity Spreadsheet -- Enzyme Inhibition Constant Data from BindingDB
Found 5 hits for monomerid = 50303806
Trg + Lig
Ki
nM
ΔG°
kcal/mole
IC50
nM
Kd
nM
EC50/IC50
nM
koff
s-1
kon
M-1s-1
pHTemp
°C
Glucocorticoid receptor
(Homo sapiens (Human))
BDBM50303806
(4-((S)-1-((5aR,6S)-1-(4-fluorophenyl)-5a-methyl-5,...)
Show SMILES C[C@](O)([C@H]1CCCC2=Cc3c(ncn3C[C@]12C)-c1ccc(F)cc1)c1ccc(cc1)C#N |r,t:7|
Show InChI InChI=1S/C27H26FN3O/c1-26-16-31-17-30-25(19-8-12-22(28)13-9-19)23(31)14-21(26)4-3-5-24(26)27(2,32)20-10-6-18(15-29)7-11-20/h6-14,17,24,32H,3-5,16H2,1-2H3/t24-,26-,27+/m0/s1
2.5n/an/an/an/an/an/an/an/a
Bristol-Myers Squibb Company
Curated by ChEMBL
Assay Description
Displacement of GS-red from human glucocorticoid receptor by fluorescent polarization assay
J Med Chem 53: 1270-80 (2010)
Article DOI: 10.1021/jm901551w
BindingDB Entry DOI: 10.7270/Q2KS6SGW
Glucocorticoid receptor
(Homo sapiens (Human))
BDBM50303806
(4-((S)-1-((5aR,6S)-1-(4-fluorophenyl)-5a-methyl-5,...)
Show SMILES C[C@](O)([C@H]1CCCC2=Cc3c(ncn3C[C@]12C)-c1ccc(F)cc1)c1ccc(cc1)C#N |r,t:7|
Show InChI InChI=1S/C27H26FN3O/c1-26-16-31-17-30-25(19-8-12-22(28)13-9-19)23(31)14-21(26)4-3-5-24(26)27(2,32)20-10-6-18(15-29)7-11-20/h6-14,17,24,32H,3-5,16H2,1-2H3/t24-,26-,27+/m0/s1
n/an/an/an/a 105n/an/an/an/a
Bristol-Myers Squibb Company
Curated by ChEMBL
Assay Description
Transrepression activity at glucocorticoid receptor expressed in human A549 cells assessed as inhibition of IL-1-beta-induced NF-kappaB dependent E-s...
J Med Chem 53: 1270-80 (2010)
Article DOI: 10.1021/jm901551w
BindingDB Entry DOI: 10.7270/Q2KS6SGW
Glucocorticoid receptor
(Homo sapiens (Human))
BDBM50303806
(4-((S)-1-((5aR,6S)-1-(4-fluorophenyl)-5a-methyl-5,...)
Show SMILES C[C@](O)([C@H]1CCCC2=Cc3c(ncn3C[C@]12C)-c1ccc(F)cc1)c1ccc(cc1)C#N |r,t:7|
Show InChI InChI=1S/C27H26FN3O/c1-26-16-31-17-30-25(19-8-12-22(28)13-9-19)23(31)14-21(26)4-3-5-24(26)27(2,32)20-10-6-18(15-29)7-11-20/h6-14,17,24,32H,3-5,16H2,1-2H3/t24-,26-,27+/m0/s1
n/an/an/an/a 59n/an/an/an/a
Bristol-Myers Squibb Company
Curated by ChEMBL
Assay Description
Transrepression activity at glucocorticoid receptor expressed in human A549 cells assessed as inhibition of PMA-induced AP1 activity after 6 hrs by l...
J Med Chem 53: 1270-80 (2010)
Article DOI: 10.1021/jm901551w
BindingDB Entry DOI: 10.7270/Q2KS6SGW
Glucocorticoid receptor
(Homo sapiens (Human))
BDBM50303806
(4-((S)-1-((5aR,6S)-1-(4-fluorophenyl)-5a-methyl-5,...)
Show SMILES C[C@](O)([C@H]1CCCC2=Cc3c(ncn3C[C@]12C)-c1ccc(F)cc1)c1ccc(cc1)C#N |r,t:7|
Show InChI InChI=1S/C27H26FN3O/c1-26-16-31-17-30-25(19-8-12-22(28)13-9-19)23(31)14-21(26)4-3-5-24(26)27(2,32)20-10-6-18(15-29)7-11-20/h6-14,17,24,32H,3-5,16H2,1-2H3/t24-,26-,27+/m0/s1
n/an/an/an/a>1.00E+4n/an/an/an/a
Bristol-Myers Squibb Company
Curated by ChEMBL
Assay Description
Transactivation of GAL-4 tagged glucocorticoid receptor ligand binding domain expressed in human HeLa cells assessed as NP1 activation by luciferase ...
J Med Chem 53: 1270-80 (2010)
Article DOI: 10.1021/jm901551w
BindingDB Entry DOI: 10.7270/Q2KS6SGW
Androgen Receptor
(Homo sapiens (Human))
BDBM50303806
(4-((S)-1-((5aR,6S)-1-(4-fluorophenyl)-5a-methyl-5,...)
Show SMILES C[C@](O)([C@H]1CCCC2=Cc3c(ncn3C[C@]12C)-c1ccc(F)cc1)c1ccc(cc1)C#N |r,t:7|
Show InChI InChI=1S/C27H26FN3O/c1-26-16-31-17-30-25(19-8-12-22(28)13-9-19)23(31)14-21(26)4-3-5-24(26)27(2,32)20-10-6-18(15-29)7-11-20/h6-14,17,24,32H,3-5,16H2,1-2H3/t24-,26-,27+/m0/s1
NCI pathway
Reactome pathway
n/an/a>4.00E+3n/an/an/an/an/an/a
Bristol-Myers Squibb Company
Curated by ChEMBL
Assay Description
Binding affinity to androgen receptor
J Med Chem 53: 1270-80 (2010)
Article DOI: 10.1021/jm901551w
BindingDB Entry DOI: 10.7270/Q2KS6SGW