BDBM50303807 (S)-1-((5aR,6S)-1-(4-Fluorophenyl)-5a-methyl-5,5a,6,7,8,9-hexahydroimidazo[1,5-b]isoquinolin-6-yl)-1-(pyridin-2-yl)ethanol::CHEMBL583859
SMILES: C[C@](O)([C@H]1CCCC2=Cc3c(ncn3C[C@]12C)-c1ccc(F)cc1)c1ccccn1
InChI Key: InChIKey=GZRLYBKRWQKXFO-TUSQITKMSA-N
Data: 1 KI  1 IC50  3 EC50
Activity Spreadsheet -- Enzyme Inhibition Constant Data from BindingDB
Found 5 hits for monomerid = 50303807
Trg + Lig
Ki
nM
ΔG°
kcal/mole
IC50
nM
Kd
nM
EC50/IC50
nM
koff
s-1
kon
M-1s-1
pHTemp
°C
Glucocorticoid receptor
(Homo sapiens (Human))
BDBM50303807
((S)-1-((5aR,6S)-1-(4-Fluorophenyl)-5a-methyl-5,5a,...)
Show SMILES C[C@](O)([C@H]1CCCC2=Cc3c(ncn3C[C@]12C)-c1ccc(F)cc1)c1ccccn1 |r,t:7|
Show InChI InChI=1S/C25H26FN3O/c1-24-15-29-16-28-23(17-9-11-19(26)12-10-17)20(29)14-18(24)6-5-7-21(24)25(2,30)22-8-3-4-13-27-22/h3-4,8-14,16,21,30H,5-7,15H2,1-2H3/t21-,24-,25-/m0/s1
31n/an/an/an/an/an/an/an/a
Bristol-Myers Squibb Company
Curated by ChEMBL
Assay Description
Displacement of GS-red from human glucocorticoid receptor by fluorescent polarization assay
J Med Chem 53: 1270-80 (2010)
Article DOI: 10.1021/jm901551w
BindingDB Entry DOI: 10.7270/Q2KS6SGW
Glucocorticoid receptor
(Homo sapiens (Human))
BDBM50303807
((S)-1-((5aR,6S)-1-(4-Fluorophenyl)-5a-methyl-5,5a,...)
Show SMILES C[C@](O)([C@H]1CCCC2=Cc3c(ncn3C[C@]12C)-c1ccc(F)cc1)c1ccccn1 |r,t:7|
Show InChI InChI=1S/C25H26FN3O/c1-24-15-29-16-28-23(17-9-11-19(26)12-10-17)20(29)14-18(24)6-5-7-21(24)25(2,30)22-8-3-4-13-27-22/h3-4,8-14,16,21,30H,5-7,15H2,1-2H3/t21-,24-,25-/m0/s1
n/an/an/an/a 398n/an/an/an/a
Bristol-Myers Squibb Company
Curated by ChEMBL
Assay Description
Transrepression activity at glucocorticoid receptor expressed in human A549 cells assessed as inhibition of IL-1-beta-induced NF-kappaB dependent E-s...
J Med Chem 53: 1270-80 (2010)
Article DOI: 10.1021/jm901551w
BindingDB Entry DOI: 10.7270/Q2KS6SGW
Glucocorticoid receptor
(Homo sapiens (Human))
BDBM50303807
((S)-1-((5aR,6S)-1-(4-Fluorophenyl)-5a-methyl-5,5a,...)
Show SMILES C[C@](O)([C@H]1CCCC2=Cc3c(ncn3C[C@]12C)-c1ccc(F)cc1)c1ccccn1 |r,t:7|
Show InChI InChI=1S/C25H26FN3O/c1-24-15-29-16-28-23(17-9-11-19(26)12-10-17)20(29)14-18(24)6-5-7-21(24)25(2,30)22-8-3-4-13-27-22/h3-4,8-14,16,21,30H,5-7,15H2,1-2H3/t21-,24-,25-/m0/s1
n/an/an/an/a 280n/an/an/an/a
Bristol-Myers Squibb Company
Curated by ChEMBL
Assay Description
Transrepression activity at glucocorticoid receptor expressed in human A549 cells assessed as inhibition of PMA-induced AP1 activity after 6 hrs by l...
J Med Chem 53: 1270-80 (2010)
Article DOI: 10.1021/jm901551w
BindingDB Entry DOI: 10.7270/Q2KS6SGW
Glucocorticoid receptor
(Homo sapiens (Human))
BDBM50303807
((S)-1-((5aR,6S)-1-(4-Fluorophenyl)-5a-methyl-5,5a,...)
Show SMILES C[C@](O)([C@H]1CCCC2=Cc3c(ncn3C[C@]12C)-c1ccc(F)cc1)c1ccccn1 |r,t:7|
Show InChI InChI=1S/C25H26FN3O/c1-24-15-29-16-28-23(17-9-11-19(26)12-10-17)20(29)14-18(24)6-5-7-21(24)25(2,30)22-8-3-4-13-27-22/h3-4,8-14,16,21,30H,5-7,15H2,1-2H3/t21-,24-,25-/m0/s1
n/an/an/an/a>1.00E+4n/an/an/an/a
Bristol-Myers Squibb Company
Curated by ChEMBL
Assay Description
Transactivation of GAL-4 tagged glucocorticoid receptor ligand binding domain expressed in human HeLa cells assessed as NP1 activation by luciferase ...
J Med Chem 53: 1270-80 (2010)
Article DOI: 10.1021/jm901551w
BindingDB Entry DOI: 10.7270/Q2KS6SGW
Androgen Receptor
(Homo sapiens (Human))
BDBM50303807
((S)-1-((5aR,6S)-1-(4-Fluorophenyl)-5a-methyl-5,5a,...)
Show SMILES C[C@](O)([C@H]1CCCC2=Cc3c(ncn3C[C@]12C)-c1ccc(F)cc1)c1ccccn1 |r,t:7|
Show InChI InChI=1S/C25H26FN3O/c1-24-15-29-16-28-23(17-9-11-19(26)12-10-17)20(29)14-18(24)6-5-7-21(24)25(2,30)22-8-3-4-13-27-22/h3-4,8-14,16,21,30H,5-7,15H2,1-2H3/t21-,24-,25-/m0/s1
NCI pathway
Reactome pathway
n/an/a>4.00E+3n/an/an/an/an/an/a
Bristol-Myers Squibb Company
Curated by ChEMBL
Assay Description
Binding affinity to androgen receptor
J Med Chem 53: 1270-80 (2010)
Article DOI: 10.1021/jm901551w
BindingDB Entry DOI: 10.7270/Q2KS6SGW