BDBM50303821 (R)-1-((5aR,6S)-1-(4-Fluorophenyl)-5a-methyl-5,5a,6,7,8,9-hexahydroimidazo[1,5-b]isoquinolin-6-yl)-1-(tetrahydro-2H-pyran-4-yl)-ethanol::CHEMBL572355
SMILES: C[C@@](O)(C1CCOCC1)[C@H]1CCCC2=Cc3c(ncn3C[C@]12C)-c1ccc(F)cc1
InChI Key: InChIKey=XIEBKQNZRFBICJ-ZKMPZPQNSA-N
Data: 1 KI  1 IC50  3 EC50
Activity Spreadsheet -- Enzyme Inhibition Constant Data from BindingDB
Found 5 hits for monomerid = 50303821
Trg + Lig
Ki
nM
ΔG°
kcal/mole
IC50
nM
Kd
nM
EC50/IC50
nM
koff
s-1
kon
M-1s-1
pHTemp
°C
Glucocorticoid receptor
(Homo sapiens (Human))
BDBM50303821
((R)-1-((5aR,6S)-1-(4-Fluorophenyl)-5a-methyl-5,5a,...)
Show SMILES C[C@@](O)(C1CCOCC1)[C@H]1CCCC2=Cc3c(ncn3C[C@]12C)-c1ccc(F)cc1 |r,t:14|
Show InChI InChI=1S/C25H31FN2O2/c1-24-15-28-16-27-23(17-6-8-20(26)9-7-17)21(28)14-19(24)4-3-5-22(24)25(2,29)18-10-12-30-13-11-18/h6-9,14,16,18,22,29H,3-5,10-13,15H2,1-2H3/t22-,24-,25+/m0/s1
2n/an/an/an/an/an/an/an/a
Bristol-Myers Squibb Company
Curated by ChEMBL
Assay Description
Displacement of GS-red from human glucocorticoid receptor by fluorescent polarization assay
J Med Chem 53: 1270-80 (2010)
Article DOI: 10.1021/jm901551w
BindingDB Entry DOI: 10.7270/Q2KS6SGW
Glucocorticoid receptor
(Homo sapiens (Human))
BDBM50303821
((R)-1-((5aR,6S)-1-(4-Fluorophenyl)-5a-methyl-5,5a,...)
Show SMILES C[C@@](O)(C1CCOCC1)[C@H]1CCCC2=Cc3c(ncn3C[C@]12C)-c1ccc(F)cc1 |r,t:14|
Show InChI InChI=1S/C25H31FN2O2/c1-24-15-28-16-27-23(17-6-8-20(26)9-7-17)21(28)14-19(24)4-3-5-22(24)25(2,29)18-10-12-30-13-11-18/h6-9,14,16,18,22,29H,3-5,10-13,15H2,1-2H3/t22-,24-,25+/m0/s1
n/an/an/an/a 48n/an/an/an/a
Bristol-Myers Squibb Company
Curated by ChEMBL
Assay Description
Transrepression activity at glucocorticoid receptor expressed in human A549 cells assessed as inhibition of IL-1-beta-induced NF-kappaB dependent E-s...
J Med Chem 53: 1270-80 (2010)
Article DOI: 10.1021/jm901551w
BindingDB Entry DOI: 10.7270/Q2KS6SGW
Glucocorticoid receptor
(Homo sapiens (Human))
BDBM50303821
((R)-1-((5aR,6S)-1-(4-Fluorophenyl)-5a-methyl-5,5a,...)
Show SMILES C[C@@](O)(C1CCOCC1)[C@H]1CCCC2=Cc3c(ncn3C[C@]12C)-c1ccc(F)cc1 |r,t:14|
Show InChI InChI=1S/C25H31FN2O2/c1-24-15-28-16-27-23(17-6-8-20(26)9-7-17)21(28)14-19(24)4-3-5-22(24)25(2,29)18-10-12-30-13-11-18/h6-9,14,16,18,22,29H,3-5,10-13,15H2,1-2H3/t22-,24-,25+/m0/s1
n/an/an/an/a 57n/an/an/an/a
Bristol-Myers Squibb Company
Curated by ChEMBL
Assay Description
Transrepression activity at glucocorticoid receptor expressed in human A549 cells assessed as inhibition of PMA-induced AP1 activity after 6 hrs by l...
J Med Chem 53: 1270-80 (2010)
Article DOI: 10.1021/jm901551w
BindingDB Entry DOI: 10.7270/Q2KS6SGW
Glucocorticoid receptor
(Homo sapiens (Human))
BDBM50303821
((R)-1-((5aR,6S)-1-(4-Fluorophenyl)-5a-methyl-5,5a,...)
Show SMILES C[C@@](O)(C1CCOCC1)[C@H]1CCCC2=Cc3c(ncn3C[C@]12C)-c1ccc(F)cc1 |r,t:14|
Show InChI InChI=1S/C25H31FN2O2/c1-24-15-28-16-27-23(17-6-8-20(26)9-7-17)21(28)14-19(24)4-3-5-22(24)25(2,29)18-10-12-30-13-11-18/h6-9,14,16,18,22,29H,3-5,10-13,15H2,1-2H3/t22-,24-,25+/m0/s1
n/an/an/an/a>1.00E+3n/an/an/an/a
Bristol-Myers Squibb Company
Curated by ChEMBL
Assay Description
Transactivation of GAL-4 tagged glucocorticoid receptor ligand binding domain expressed in human HeLa cells assessed as NP1 activation by luciferase ...
J Med Chem 53: 1270-80 (2010)
Article DOI: 10.1021/jm901551w
BindingDB Entry DOI: 10.7270/Q2KS6SGW
Androgen Receptor
(Homo sapiens (Human))
BDBM50303821
((R)-1-((5aR,6S)-1-(4-Fluorophenyl)-5a-methyl-5,5a,...)
Show SMILES C[C@@](O)(C1CCOCC1)[C@H]1CCCC2=Cc3c(ncn3C[C@]12C)-c1ccc(F)cc1 |r,t:14|
Show InChI InChI=1S/C25H31FN2O2/c1-24-15-28-16-27-23(17-6-8-20(26)9-7-17)21(28)14-19(24)4-3-5-22(24)25(2,29)18-10-12-30-13-11-18/h6-9,14,16,18,22,29H,3-5,10-13,15H2,1-2H3/t22-,24-,25+/m0/s1
NCI pathway
Reactome pathway
n/an/a>4.00E+3n/an/an/an/an/an/a
Bristol-Myers Squibb Company
Curated by ChEMBL
Assay Description
Binding affinity to androgen receptor
J Med Chem 53: 1270-80 (2010)
Article DOI: 10.1021/jm901551w
BindingDB Entry DOI: 10.7270/Q2KS6SGW