BDBM50303912 2,2'-methylenebis(4-chlorophenol)::3,3'-dichloro-6,6'-dihydroxydiphenylmethane::4-chloro-2-(5-chloro-2-hydroxybenzyl)phenol::CHEMBL33845::Dichlorophen::Dichlorophene
SMILES: Oc1ccc(Cl)cc1Cc1cc(Cl)ccc1O
InChI Key: InChIKey=MDNWOSOZYLHTCG-UHFFFAOYSA-N
Data: 8 IC50
PDB links: 1 PDB ID matches this monomer.
Activity Spreadsheet -- Enzyme Inhibition Constant Data from BindingDB
Found 8 hits for monomerid = 50303912
Trg + Lig
Ki
nM
ΔG°
kcal/mole
IC50
nM
Kd
nM
EC50/IC50
nM
koff
s-1
kon
M-1s-1
pHTemp
°C
Indoleamine 2,3-dioxygenase
(Homo sapiens (Human))
BDBM50303912
(2,2'-methylenebis(4-chlorophenol) | 3,3'-dichloro-...)
Show SMILES Oc1ccc(Cl)cc1Cc1cc(Cl)ccc1O
Show InChI InChI=1S/C13H10Cl2O2/c14-10-1-3-12(16)8(6-10)5-9-7-11(15)2-4-13(9)17/h1-4,6-7,16-17H,5H2
Reactome pathway
n/an/a 7.00E+4n/an/an/an/an/an/a
Institute for Cancer Research
Curated by ChEMBL
Assay Description
Inhibition of human recombinant IDO expressed in Escherichia coli BL21 AI
J Med Chem 53: 1172-89 (2010)
Article DOI: 10.1021/jm9014718
BindingDB Entry DOI: 10.7270/Q2BC40G9
Adrenergic Alpha
(Homo sapiens (Human))
BDBM50303912
(2,2'-methylenebis(4-chlorophenol) | 3,3'-dichloro-...)
Show SMILES Oc1ccc(Cl)cc1Cc1cc(Cl)ccc1O
Show InChI InChI=1S/C13H10Cl2O2/c14-10-1-3-12(16)8(6-10)5-9-7-11(15)2-4-13(9)17/h1-4,6-7,16-17H,5H2
n/an/a 8.41E+3n/an/an/an/an/an/a
University of California
Curated by ChEMBL
Assay Description
Inhibition of human OCT1 expressed in HEK293 cells assessed as decrease in uptake of MPP+ after 1 min
J Med Chem 60: 2685-2696 (2017)
Article DOI: 10.1021/acs.jmedchem.6b01317
BindingDB Entry DOI: 10.7270/Q2NV9MHQ
Grp78
(Homo sapiens (Human))
BDBM50303912
(2,2'-methylenebis(4-chlorophenol) | 3,3'-dichloro-...)
Show SMILES Oc1ccc(Cl)cc1Cc1cc(Cl)ccc1O
Show InChI InChI=1S/C13H10Cl2O2/c14-10-1-3-12(16)8(6-10)5-9-7-11(15)2-4-13(9)17/h1-4,6-7,16-17H,5H2
n/an/a 1.00E+5n/an/an/an/an/an/a
University of Arizona
Curated by ChEMBL
Assay Description
Inhibition of GRP78 (26 to 636 residues) (unknown origin) expressed in Escherichia coli BL21 DE3 cells pre-incubated for 10 mins before FITC-NRLLLTG ...
Bioorg Med Chem Lett 29: 1689-1693 (2019)
Article DOI: 10.1016/j.bmcl.2019.05.041
60 kDa chaperonin
(Escherichia coli)
BDBM50303912
(2,2'-methylenebis(4-chlorophenol) | 3,3'-dichloro-...)
Show SMILES Oc1ccc(Cl)cc1Cc1cc(Cl)ccc1O
Show InChI InChI=1S/C13H10Cl2O2/c14-10-1-3-12(16)8(6-10)5-9-7-11(15)2-4-13(9)17/h1-4,6-7,16-17H,5H2
n/an/a>2.50E+5n/an/an/an/an/an/a
Indiana University School of Medicine
Curated by ChEMBL
Assay Description
Inhibition of ATPase activity of Escherichia coli GroEL expressed in Escherichia coliDH5alpha incubated for 60 mins using ATP by spectrometric analys...
Bioorg Med Chem Lett 29: 1106-1112 (2019)
Article DOI: 10.1016/j.bmcl.2019.02.028
10 kDa chaperonin
(Escherichia coli)
BDBM50303912
(2,2'-methylenebis(4-chlorophenol) | 3,3'-dichloro-...)
Show SMILES Oc1ccc(Cl)cc1Cc1cc(Cl)ccc1O
Show InChI InChI=1S/C13H10Cl2O2/c14-10-1-3-12(16)8(6-10)5-9-7-11(15)2-4-13(9)17/h1-4,6-7,16-17H,5H2
n/an/a 2.40E+4n/an/an/an/an/an/a
Indiana University School of Medicine
Curated by ChEMBL
Assay Description
Inhibition of Escherichia coli GroEL expressed in Escherichia coliDH5alpha/Escherichia coli GroES expressed in Escherichia coli BL21 (DE3) assessed a...
Bioorg Med Chem Lett 29: 1106-1112 (2019)
Article DOI: 10.1016/j.bmcl.2019.02.028
10 kDa chaperonin
(Escherichia coli)
BDBM50303912
(2,2'-methylenebis(4-chlorophenol) | 3,3'-dichloro-...)
Show SMILES Oc1ccc(Cl)cc1Cc1cc(Cl)ccc1O
Show InChI InChI=1S/C13H10Cl2O2/c14-10-1-3-12(16)8(6-10)5-9-7-11(15)2-4-13(9)17/h1-4,6-7,16-17H,5H2
n/an/a 6.60E+4n/an/an/an/an/an/a
Indiana University School of Medicine
Curated by ChEMBL
Assay Description
Inhibition of Escherichia coli GroEL expressed in Escherichia coli DH5alpha/Escherichia coli GroES expressed in Escherichia coli BL21 (DE3) assessed ...
Bioorg Med Chem Lett 29: 1106-1112 (2019)
Article DOI: 10.1016/j.bmcl.2019.02.028
HSP60/HSP10
(Homo sapiens)
BDBM50303912
(2,2'-methylenebis(4-chlorophenol) | 3,3'-dichloro-...)
Show SMILES Oc1ccc(Cl)cc1Cc1cc(Cl)ccc1O
Show InChI InChI=1S/C13H10Cl2O2/c14-10-1-3-12(16)8(6-10)5-9-7-11(15)2-4-13(9)17/h1-4,6-7,16-17H,5H2
n/an/a 1.70E+4n/an/an/an/an/an/a
Indiana University School of Medicine
Curated by ChEMBL
Assay Description
Inhibition of human N-terminal octa-His-tagged HSP60 expressed in Escherichia coli Rosetta(DE3) pLysS/human HSP10 expressed in Escherichia coli Roset...
Bioorg Med Chem Lett 29: 1106-1112 (2019)
Article DOI: 10.1016/j.bmcl.2019.02.028
Thiosulfate sulfurtransferase
(Homo sapiens)
BDBM50303912
(2,2'-methylenebis(4-chlorophenol) | 3,3'-dichloro-...)
Show SMILES Oc1ccc(Cl)cc1Cc1cc(Cl)ccc1O
Show InChI InChI=1S/C13H10Cl2O2/c14-10-1-3-12(16)8(6-10)5-9-7-11(15)2-4-13(9)17/h1-4,6-7,16-17H,5H2
n/an/a>1.00E+5n/an/an/an/an/an/a
Indiana University School of Medicine
Curated by ChEMBL
Assay Description
Inhibition of native rhodanese (unknown origin) assessed as reduction in rhodanese enzyme activity after 45 mins by Fe(SCN)3 dye based spectrometric ...
Bioorg Med Chem Lett 29: 1106-1112 (2019)
Article DOI: 10.1016/j.bmcl.2019.02.028