BDBM50304110 (Z)-5'-Amino-1H,1'H-[2,3']biindolylidene-3,2'-dione::5'-Amino-1H,1'H-[2,3']biindolylidene-3,2'-dione::CHEMBL594192
SMILES: Nc1ccc2NC(=O)C(=C3Nc4ccccc4C3=O)c2c1
InChI Key: InChIKey=UKVQMBJHWHGXOI-UHFFFAOYSA-N
Data: 4 IC50
Activity Spreadsheet -- Enzyme Inhibition Constant Data from BindingDB
Found 4 hits for monomerid = 50304110
Trg + Lig
Ki
nM
ΔG°
kcal/mole
IC50
nM
Kd
nM
EC50/IC50
nM
koff
s-1
kon
M-1s-1
pHTemp
°C
Serine/threonine-protein kinase 17B (STK17B)
(Homo sapiens (Human))
BDBM50304110
((Z)-5'-Amino-1H,1'H-[2,3']biindolylidene-3,2'-dion...)
Show SMILES Nc1ccc2NC(=O)C(=C3Nc4ccccc4C3=O)c2c1 |w:9.18|
Show InChI InChI=1S/C16H11N3O2/c17-8-5-6-12-10(7-8)13(16(21)19-12)14-15(20)9-3-1-2-4-11(9)18-14/h1-7,18H,17H2,(H,19,21)
n/an/a 1.40E+3n/an/an/an/an/an/a
Korea Research Institute of Chemical Technology
Curated by ChEMBL
Assay Description
Inhibition of DRAK2 (unknown origin) using MRLC3 peptide as substrate incubated for 2 hrs by ADP-Glo kinase assay
Bioorg Med Chem Lett 26: 2719-23 (2016)
Article DOI: 10.1016/j.bmcl.2016.03.111
BindingDB Entry DOI: 10.7270/Q2N29ZTZ
Receptor-type tyrosine-protein kinase FLT3
(Homo sapiens (Human))
BDBM50304110
((Z)-5'-Amino-1H,1'H-[2,3']biindolylidene-3,2'-dion...)
Show SMILES Nc1ccc2NC(=O)C(=C3Nc4ccccc4C3=O)c2c1 |w:9.18|
Show InChI InChI=1S/C16H11N3O2/c17-8-5-6-12-10(7-8)13(16(21)19-12)14-15(20)9-3-1-2-4-11(9)18-14/h1-7,18H,17H2,(H,19,21)
n/an/a 359n/an/an/an/an/an/a
Institute of Science and Technology
Curated by ChEMBL
Assay Description
Inhibition of FLT3 by HTRF assay
Bioorg Med Chem Lett 20: 2033-7 (2010)
Article DOI: 10.1016/j.bmcl.2010.01.039
BindingDB Entry DOI: 10.7270/Q29W0GF0
Cyclin-Dependent Kinase 5 (CDK5)
(Homo sapiens (Human))
BDBM50304110
((Z)-5'-Amino-1H,1'H-[2,3']biindolylidene-3,2'-dion...)
Show SMILES Nc1ccc2NC(=O)C(=C3Nc4ccccc4C3=O)c2c1 |w:9.18|
Show InChI InChI=1S/C16H11N3O2/c17-8-5-6-12-10(7-8)13(16(21)19-12)14-15(20)9-3-1-2-4-11(9)18-14/h1-7,18H,17H2,(H,19,21)
NCI pathway
Reactome pathway
n/an/a 590n/an/an/an/an/an/a
Universit£ de La Rochelle
Curated by ChEMBL
Assay Description
Inhibition of GST-fused CDK5/p25 expressed in Escherichia coli assessed as [gamma-33P]ATP incorporation after 10 mins by scintillation counting
Bioorg Med Chem 17: 6257-63 (2009)
Article DOI: 10.1016/j.bmc.2009.07.051
BindingDB Entry DOI: 10.7270/Q2BR8S9W
Dual-specificity tyrosine-(Y)-phosphorylation regulated kinase 1A
(RAT)
BDBM50304110
((Z)-5'-Amino-1H,1'H-[2,3']biindolylidene-3,2'-dion...)
Show SMILES Nc1ccc2NC(=O)C(=C3Nc4ccccc4C3=O)c2c1 |w:9.18|
Show InChI InChI=1S/C16H11N3O2/c17-8-5-6-12-10(7-8)13(16(21)19-12)14-15(20)9-3-1-2-4-11(9)18-14/h1-7,18H,17H2,(H,19,21)
n/an/a 2.50E+3n/an/an/an/an/an/a
Universit£ de La Rochelle
Curated by ChEMBL
Assay Description
Inhibition of GST-fused rat recombinant DYRK1A expressed in Escherichia coli assessed as [gamma-33P]ATP incorporation after 10 mins by scintillation ...
Bioorg Med Chem 17: 6257-63 (2009)
Article DOI: 10.1016/j.bmc.2009.07.051
BindingDB Entry DOI: 10.7270/Q2BR8S9W