BDBM50304143 4-nitro-1H-indazole::CHEMBL393456
SMILES: [O-][N+](=O)c1cccc2[nH]ncc12
InChI Key: InChIKey=WBTVZVUYPVQEIF-UHFFFAOYSA-N
Data: 1 IC50
Activity Spreadsheet -- Enzyme Inhibition Constant Data from BindingDB
Found 1 hit for monomerid = 50304143
Trg + Lig
Ki
nM
ΔG°
kcal/mole
IC50
nM
Kd
nM
EC50/IC50
nM
koff
s-1
kon
M-1s-1
pHTemp
°C
Nitric oxide synthase, brain
(Homo sapiens (Human))
BDBM50304143
(4-nitro-1H-indazole | CHEMBL393456)
Show SMILES [O-][N+](=O)c1cccc2[nH]ncc12
Show InChI InChI=1S/C7H5N3O2/c11-10(12)7-3-1-2-6-5(7)4-8-9-6/h1-4H,(H,8,9)
Reactome pathway
n/an/a 3.10E+3n/an/an/an/an/an/a
UNED
Curated by ChEMBL
Assay Description
Inhibition of NOS1
Bioorg Med Chem 17: 6180-7 (2009)
Article DOI: 10.1016/j.bmc.2009.07.067
BindingDB Entry DOI: 10.7270/Q2ZG6SBD