BDBM50304204 2-(4-(6-methoxy-7-(3-(pyrrolidin-1-yl)propoxy)quinazolin-4-yloxy)phenyl)benzo[d]thiazole::CHEMBL595373
SMILES: COc1cc2c(Oc3ccc(cc3)-c3nc4ccccc4s3)ncnc2cc1OCCCN1CCCC1
InChI Key: InChIKey=ZIJIMHMKDXTURQ-UHFFFAOYSA-N
Data: 7 IC50  4 EC50
Activity Spreadsheet -- Enzyme Inhibition Constant Data from BindingDB
Found 11 hits for monomerid = 50304204
Trg + Lig
Ki
nM
ΔG°
kcal/mole
IC50
nM
Kd
nM
EC50/IC50
nM
koff
s-1
kon
M-1s-1
pHTemp
°C
Vascular endothelial growth factor receptor 3
(Homo sapiens (Human))
BDBM50304204
(2-(4-(6-methoxy-7-(3-(pyrrolidin-1-yl)propoxy)quin...)
Show SMILES COc1cc2c(Oc3ccc(cc3)-c3nc4ccccc4s3)ncnc2cc1OCCCN1CCCC1
Show InChI InChI=1S/C29H28N4O3S/c1-34-25-17-22-24(18-26(25)35-16-6-15-33-13-4-5-14-33)30-19-31-28(22)36-21-11-9-20(10-12-21)29-32-23-7-2-3-8-27(23)37-29/h2-3,7-12,17-19H,4-6,13-16H2,1H3
n/an/a 140n/an/an/an/an/an/a
4SC AG
Curated by ChEMBL
Assay Description
Inhibition of VEGFR3 by microplate scintillation counting
Bioorg Med Chem 17: 6728-37 (2009)
Article DOI: 10.1016/j.bmc.2009.07.047
BindingDB Entry DOI: 10.7270/Q2FJ2GWC
Aurora kinase B
(Homo sapiens (Human))
BDBM50304204
(2-(4-(6-methoxy-7-(3-(pyrrolidin-1-yl)propoxy)quin...)
Show SMILES COc1cc2c(Oc3ccc(cc3)-c3nc4ccccc4s3)ncnc2cc1OCCCN1CCCC1
Show InChI InChI=1S/C29H28N4O3S/c1-34-25-17-22-24(18-26(25)35-16-6-15-33-13-4-5-14-33)30-19-31-28(22)36-21-11-9-20(10-12-21)29-32-23-7-2-3-8-27(23)37-29/h2-3,7-12,17-19H,4-6,13-16H2,1H3
Reactome pathway
n/an/a 162n/an/an/an/an/an/a
4SC AG
Curated by ChEMBL
Assay Description
Inhibition of Aurora-B by microplate scintillation counting
Bioorg Med Chem 17: 6728-37 (2009)
Article DOI: 10.1016/j.bmc.2009.07.047
BindingDB Entry DOI: 10.7270/Q2FJ2GWC
Platelet-derived growth factor receptor beta
(Homo sapiens (Human))
BDBM50304204
(2-(4-(6-methoxy-7-(3-(pyrrolidin-1-yl)propoxy)quin...)
Show SMILES COc1cc2c(Oc3ccc(cc3)-c3nc4ccccc4s3)ncnc2cc1OCCCN1CCCC1
Show InChI InChI=1S/C29H28N4O3S/c1-34-25-17-22-24(18-26(25)35-16-6-15-33-13-4-5-14-33)30-19-31-28(22)36-21-11-9-20(10-12-21)29-32-23-7-2-3-8-27(23)37-29/h2-3,7-12,17-19H,4-6,13-16H2,1H3
NCI pathway
Reactome pathway
n/an/an/an/a 2.00E+3n/an/an/an/a
4SC AG
Curated by ChEMBL
Assay Description
Inhibition of PDGFRbeta in human HCT116 cells by cellular phosphorylation assay
Bioorg Med Chem 17: 6728-37 (2009)
Article DOI: 10.1016/j.bmc.2009.07.047
BindingDB Entry DOI: 10.7270/Q2FJ2GWC
Aurora kinase B
(Homo sapiens (Human))
BDBM50304204
(2-(4-(6-methoxy-7-(3-(pyrrolidin-1-yl)propoxy)quin...)
Show SMILES COc1cc2c(Oc3ccc(cc3)-c3nc4ccccc4s3)ncnc2cc1OCCCN1CCCC1
Show InChI InChI=1S/C29H28N4O3S/c1-34-25-17-22-24(18-26(25)35-16-6-15-33-13-4-5-14-33)30-19-31-28(22)36-21-11-9-20(10-12-21)29-32-23-7-2-3-8-27(23)37-29/h2-3,7-12,17-19H,4-6,13-16H2,1H3
Reactome pathway
n/an/an/an/a>1.00E+4n/an/an/an/a
4SC AG
Curated by ChEMBL
Assay Description
Inhibition of Aurora-B in human HCT116 cells by cellular proliferation assay
Bioorg Med Chem 17: 6728-37 (2009)
Article DOI: 10.1016/j.bmc.2009.07.047
BindingDB Entry DOI: 10.7270/Q2FJ2GWC
Vascular endothelial growth factor receptor 3
(Homo sapiens (Human))
BDBM50304204
(2-(4-(6-methoxy-7-(3-(pyrrolidin-1-yl)propoxy)quin...)
Show SMILES COc1cc2c(Oc3ccc(cc3)-c3nc4ccccc4s3)ncnc2cc1OCCCN1CCCC1
Show InChI InChI=1S/C29H28N4O3S/c1-34-25-17-22-24(18-26(25)35-16-6-15-33-13-4-5-14-33)30-19-31-28(22)36-21-11-9-20(10-12-21)29-32-23-7-2-3-8-27(23)37-29/h2-3,7-12,17-19H,4-6,13-16H2,1H3
n/an/an/an/a 800n/an/an/an/a
4SC AG
Curated by ChEMBL
Assay Description
Inhibition of VEGFR3 in human HCT116 cells by cellular phosphorylation assay
Bioorg Med Chem 17: 6728-37 (2009)
Article DOI: 10.1016/j.bmc.2009.07.047
BindingDB Entry DOI: 10.7270/Q2FJ2GWC
Epidermal growth factor receptor
(Homo sapiens (Human))
BDBM50304204
(2-(4-(6-methoxy-7-(3-(pyrrolidin-1-yl)propoxy)quin...)
Show SMILES COc1cc2c(Oc3ccc(cc3)-c3nc4ccccc4s3)ncnc2cc1OCCCN1CCCC1
Show InChI InChI=1S/C29H28N4O3S/c1-34-25-17-22-24(18-26(25)35-16-6-15-33-13-4-5-14-33)30-19-31-28(22)36-21-11-9-20(10-12-21)29-32-23-7-2-3-8-27(23)37-29/h2-3,7-12,17-19H,4-6,13-16H2,1H3
n/an/a>1.00E+4n/an/an/an/an/an/a
4SC AG
Curated by ChEMBL
Assay Description
Inhibition of wild type EGF-R by microplate scintillation counting
Bioorg Med Chem 17: 6728-37 (2009)
Article DOI: 10.1016/j.bmc.2009.07.047
BindingDB Entry DOI: 10.7270/Q2FJ2GWC
Vascular endothelial growth factor receptor 2
(Homo sapiens (Human))
BDBM50304204
(2-(4-(6-methoxy-7-(3-(pyrrolidin-1-yl)propoxy)quin...)
Show SMILES COc1cc2c(Oc3ccc(cc3)-c3nc4ccccc4s3)ncnc2cc1OCCCN1CCCC1
Show InChI InChI=1S/C29H28N4O3S/c1-34-25-17-22-24(18-26(25)35-16-6-15-33-13-4-5-14-33)30-19-31-28(22)36-21-11-9-20(10-12-21)29-32-23-7-2-3-8-27(23)37-29/h2-3,7-12,17-19H,4-6,13-16H2,1H3
NCI pathway
Reactome pathway
n/an/a 350n/an/an/an/an/an/a
4SC AG
Curated by ChEMBL
Assay Description
Inhibition of VEGFR2 by microplate scintillation counting
Bioorg Med Chem 17: 6728-37 (2009)
Article DOI: 10.1016/j.bmc.2009.07.047
BindingDB Entry DOI: 10.7270/Q2FJ2GWC
Angiopoietin-1 receptor
(Homo sapiens (Human))
BDBM50304204
(2-(4-(6-methoxy-7-(3-(pyrrolidin-1-yl)propoxy)quin...)
Show SMILES COc1cc2c(Oc3ccc(cc3)-c3nc4ccccc4s3)ncnc2cc1OCCCN1CCCC1
Show InChI InChI=1S/C29H28N4O3S/c1-34-25-17-22-24(18-26(25)35-16-6-15-33-13-4-5-14-33)30-19-31-28(22)36-21-11-9-20(10-12-21)29-32-23-7-2-3-8-27(23)37-29/h2-3,7-12,17-19H,4-6,13-16H2,1H3
n/an/a 72n/an/an/an/an/an/a
4SC AG
Curated by ChEMBL
Assay Description
Inhibition of TIE2 by microplate scintillation counting
Bioorg Med Chem 17: 6728-37 (2009)
Article DOI: 10.1016/j.bmc.2009.07.047
BindingDB Entry DOI: 10.7270/Q2FJ2GWC
Platelet-derived growth factor receptor beta
(Homo sapiens (Human))
BDBM50304204
(2-(4-(6-methoxy-7-(3-(pyrrolidin-1-yl)propoxy)quin...)
Show SMILES COc1cc2c(Oc3ccc(cc3)-c3nc4ccccc4s3)ncnc2cc1OCCCN1CCCC1
Show InChI InChI=1S/C29H28N4O3S/c1-34-25-17-22-24(18-26(25)35-16-6-15-33-13-4-5-14-33)30-19-31-28(22)36-21-11-9-20(10-12-21)29-32-23-7-2-3-8-27(23)37-29/h2-3,7-12,17-19H,4-6,13-16H2,1H3
NCI pathway
Reactome pathway
n/an/a 7.70E+3n/an/an/an/an/an/a
4SC AG
Curated by ChEMBL
Assay Description
Inhibition of PDGFRbeta by microplate scintillation counting
Bioorg Med Chem 17: 6728-37 (2009)
Article DOI: 10.1016/j.bmc.2009.07.047
BindingDB Entry DOI: 10.7270/Q2FJ2GWC
Aurora kinase A
(Homo sapiens (Human))
BDBM50304204
(2-(4-(6-methoxy-7-(3-(pyrrolidin-1-yl)propoxy)quin...)
Show SMILES COc1cc2c(Oc3ccc(cc3)-c3nc4ccccc4s3)ncnc2cc1OCCCN1CCCC1
Show InChI InChI=1S/C29H28N4O3S/c1-34-25-17-22-24(18-26(25)35-16-6-15-33-13-4-5-14-33)30-19-31-28(22)36-21-11-9-20(10-12-21)29-32-23-7-2-3-8-27(23)37-29/h2-3,7-12,17-19H,4-6,13-16H2,1H3
NCI pathway
Reactome pathway
n/an/a 170n/an/an/an/an/an/a
4SC AG
Curated by ChEMBL
Assay Description
Inhibition of Aurora-A by microplate scintillation counting
Bioorg Med Chem 17: 6728-37 (2009)
Article DOI: 10.1016/j.bmc.2009.07.047
BindingDB Entry DOI: 10.7270/Q2FJ2GWC
Angiopoietin-1 receptor
(Homo sapiens (Human))
BDBM50304204
(2-(4-(6-methoxy-7-(3-(pyrrolidin-1-yl)propoxy)quin...)
Show SMILES COc1cc2c(Oc3ccc(cc3)-c3nc4ccccc4s3)ncnc2cc1OCCCN1CCCC1
Show InChI InChI=1S/C29H28N4O3S/c1-34-25-17-22-24(18-26(25)35-16-6-15-33-13-4-5-14-33)30-19-31-28(22)36-21-11-9-20(10-12-21)29-32-23-7-2-3-8-27(23)37-29/h2-3,7-12,17-19H,4-6,13-16H2,1H3
n/an/an/an/a 140n/an/an/an/a
4SC AG
Curated by ChEMBL
Assay Description
Inhibition of TIE2 in human HCT116 cells by cellular phosphorylation assay
Bioorg Med Chem 17: 6728-37 (2009)
Article DOI: 10.1016/j.bmc.2009.07.047
BindingDB Entry DOI: 10.7270/Q2FJ2GWC