BDBM50304212 CHEMBL593306::N-[4-(Benzo[d]thiazol-2''-yl)-3-chlorophenyl]-6'-methoxy-7'-[3-(4-methylpiperazin-1-yl)propoxy]quinazolin-4'-amine
SMILES: COc1ccc2nc(sc2c1)-c1ccc(Nc2ncnc3cc(OCCCN4CCN(C)CC4)c(OC)cc23)cc1
InChI Key: InChIKey=MOQBNQNUPNPLCH-UHFFFAOYSA-N
Data: 8 IC50
Activity Spreadsheet -- Enzyme Inhibition Constant Data from BindingDB
Found 8 hits for monomerid = 50304212
Trg + Lig
Ki
nM
ΔG°
kcal/mole
IC50
nM
Kd
nM
EC50/IC50
nM
koff
s-1
kon
M-1s-1
pHTemp
°C
Focal adhesion kinase 1/vascular endothelial growth factor receptor 3
(Homo sapiens (Human))
BDBM50304212
(CHEMBL593306 | N-[4-(Benzo[d]thiazol-2''-yl)-3-chl...)
Show SMILES COc1ccc2nc(sc2c1)-c1ccc(Nc2ncnc3cc(OCCCN4CCN(C)CC4)c(OC)cc23)cc1
Show InChI InChI=1S/C31H34N6O3S/c1-36-12-14-37(15-13-36)11-4-16-40-28-19-26-24(18-27(28)39-3)30(33-20-32-26)34-22-7-5-21(6-8-22)31-35-25-10-9-23(38-2)17-29(25)41-31/h5-10,17-20H,4,11-16H2,1-3H3,(H,32,33,34)
n/an/a 1.90E+3n/an/an/an/an/an/a
4SC AG
Curated by ChEMBL
Assay Description
Inhibition of VEGFR3 by microplate scintillation counting
Bioorg Med Chem 17: 6728-37 (2009)
Article DOI: 10.1016/j.bmc.2009.07.047
BindingDB Entry DOI: 10.7270/Q2FJ2GWC
Aurora kinase B
(Homo sapiens (Human))
BDBM50304212
(CHEMBL593306 | N-[4-(Benzo[d]thiazol-2''-yl)-3-chl...)
Show SMILES COc1ccc2nc(sc2c1)-c1ccc(Nc2ncnc3cc(OCCCN4CCN(C)CC4)c(OC)cc23)cc1
Show InChI InChI=1S/C31H34N6O3S/c1-36-12-14-37(15-13-36)11-4-16-40-28-19-26-24(18-27(28)39-3)30(33-20-32-26)34-22-7-5-21(6-8-22)31-35-25-10-9-23(38-2)17-29(25)41-31/h5-10,17-20H,4,11-16H2,1-3H3,(H,32,33,34)
Reactome pathway
n/an/a 48n/an/an/an/an/an/a
4SC AG
Curated by ChEMBL
Assay Description
Inhibition of Aurora-B by microplate scintillation counting
Bioorg Med Chem 17: 6728-37 (2009)
Article DOI: 10.1016/j.bmc.2009.07.047
BindingDB Entry DOI: 10.7270/Q2FJ2GWC
Aurora kinase A
(Homo sapiens (Human))
BDBM50304212
(CHEMBL593306 | N-[4-(Benzo[d]thiazol-2''-yl)-3-chl...)
Show SMILES COc1ccc2nc(sc2c1)-c1ccc(Nc2ncnc3cc(OCCCN4CCN(C)CC4)c(OC)cc23)cc1
Show InChI InChI=1S/C31H34N6O3S/c1-36-12-14-37(15-13-36)11-4-16-40-28-19-26-24(18-27(28)39-3)30(33-20-32-26)34-22-7-5-21(6-8-22)31-35-25-10-9-23(38-2)17-29(25)41-31/h5-10,17-20H,4,11-16H2,1-3H3,(H,32,33,34)
NCI pathway
Reactome pathway
n/an/a 62n/an/an/an/an/an/a
4SC AG
Curated by ChEMBL
Assay Description
Inhibition of Aurora-A by microplate scintillation counting
Bioorg Med Chem 17: 6728-37 (2009)
Article DOI: 10.1016/j.bmc.2009.07.047
BindingDB Entry DOI: 10.7270/Q2FJ2GWC
Epidermal growth factor receptor
(Homo sapiens (Human))
BDBM50304212
(CHEMBL593306 | N-[4-(Benzo[d]thiazol-2''-yl)-3-chl...)
Show SMILES COc1ccc2nc(sc2c1)-c1ccc(Nc2ncnc3cc(OCCCN4CCN(C)CC4)c(OC)cc23)cc1
Show InChI InChI=1S/C31H34N6O3S/c1-36-12-14-37(15-13-36)11-4-16-40-28-19-26-24(18-27(28)39-3)30(33-20-32-26)34-22-7-5-21(6-8-22)31-35-25-10-9-23(38-2)17-29(25)41-31/h5-10,17-20H,4,11-16H2,1-3H3,(H,32,33,34)
n/an/a 200n/an/an/an/an/an/a
4SC AG
Curated by ChEMBL
Assay Description
Inhibition of wild type EGF-R by microplate scintillation counting
Bioorg Med Chem 17: 6728-37 (2009)
Article DOI: 10.1016/j.bmc.2009.07.047
BindingDB Entry DOI: 10.7270/Q2FJ2GWC
Angiopoietin-1 receptor
(Homo sapiens (Human))
BDBM50304212
(CHEMBL593306 | N-[4-(Benzo[d]thiazol-2''-yl)-3-chl...)
Show SMILES COc1ccc2nc(sc2c1)-c1ccc(Nc2ncnc3cc(OCCCN4CCN(C)CC4)c(OC)cc23)cc1
Show InChI InChI=1S/C31H34N6O3S/c1-36-12-14-37(15-13-36)11-4-16-40-28-19-26-24(18-27(28)39-3)30(33-20-32-26)34-22-7-5-21(6-8-22)31-35-25-10-9-23(38-2)17-29(25)41-31/h5-10,17-20H,4,11-16H2,1-3H3,(H,32,33,34)
n/an/a 390n/an/an/an/an/an/a
4SC AG
Curated by ChEMBL
Assay Description
Inhibition of TIE2 by microplate scintillation counting
Bioorg Med Chem 17: 6728-37 (2009)
Article DOI: 10.1016/j.bmc.2009.07.047
BindingDB Entry DOI: 10.7270/Q2FJ2GWC
Receptor tyrosine-protein kinase erbB-2
(Homo sapiens (Human))
BDBM50304212
(CHEMBL593306 | N-[4-(Benzo[d]thiazol-2''-yl)-3-chl...)
Show SMILES COc1ccc2nc(sc2c1)-c1ccc(Nc2ncnc3cc(OCCCN4CCN(C)CC4)c(OC)cc23)cc1
Show InChI InChI=1S/C31H34N6O3S/c1-36-12-14-37(15-13-36)11-4-16-40-28-19-26-24(18-27(28)39-3)30(33-20-32-26)34-22-7-5-21(6-8-22)31-35-25-10-9-23(38-2)17-29(25)41-31/h5-10,17-20H,4,11-16H2,1-3H3,(H,32,33,34)
n/an/a 130n/an/an/an/an/an/a
4SC AG
Curated by ChEMBL
Assay Description
Inhibition of ERBB2 by microplate scintillation counting
Bioorg Med Chem 17: 6728-37 (2009)
Article DOI: 10.1016/j.bmc.2009.07.047
BindingDB Entry DOI: 10.7270/Q2FJ2GWC
Platelet-derived growth factor receptor beta
(Homo sapiens (Human))
BDBM50304212
(CHEMBL593306 | N-[4-(Benzo[d]thiazol-2''-yl)-3-chl...)
Show SMILES COc1ccc2nc(sc2c1)-c1ccc(Nc2ncnc3cc(OCCCN4CCN(C)CC4)c(OC)cc23)cc1
Show InChI InChI=1S/C31H34N6O3S/c1-36-12-14-37(15-13-36)11-4-16-40-28-19-26-24(18-27(28)39-3)30(33-20-32-26)34-22-7-5-21(6-8-22)31-35-25-10-9-23(38-2)17-29(25)41-31/h5-10,17-20H,4,11-16H2,1-3H3,(H,32,33,34)
NCI pathway
Reactome pathway
n/an/a>1.00E+4n/an/an/an/an/an/a
4SC AG
Curated by ChEMBL
Assay Description
Inhibition of PDGFRbeta by microplate scintillation counting
Bioorg Med Chem 17: 6728-37 (2009)
Article DOI: 10.1016/j.bmc.2009.07.047
BindingDB Entry DOI: 10.7270/Q2FJ2GWC
Vascular endothelial growth factor receptor 2
(Homo sapiens (Human))
BDBM50304212
(CHEMBL593306 | N-[4-(Benzo[d]thiazol-2''-yl)-3-chl...)
Show SMILES COc1ccc2nc(sc2c1)-c1ccc(Nc2ncnc3cc(OCCCN4CCN(C)CC4)c(OC)cc23)cc1
Show InChI InChI=1S/C31H34N6O3S/c1-36-12-14-37(15-13-36)11-4-16-40-28-19-26-24(18-27(28)39-3)30(33-20-32-26)34-22-7-5-21(6-8-22)31-35-25-10-9-23(38-2)17-29(25)41-31/h5-10,17-20H,4,11-16H2,1-3H3,(H,32,33,34)
NCI pathway
Reactome pathway
n/an/a 690n/an/an/an/an/an/a
4SC AG
Curated by ChEMBL
Assay Description
Inhibition of VEGFR2 by microplate scintillation counting
Bioorg Med Chem 17: 6728-37 (2009)
Article DOI: 10.1016/j.bmc.2009.07.047
BindingDB Entry DOI: 10.7270/Q2FJ2GWC