BDBM50304302 3'-oxo-N-(5-phenylpyrazin-2-yl)-3'H-spiro[cyclohexane-1,1'-isobenzofuran]-4-carboxamide::CHEMBL594156
SMILES:
InChI Key: InChIKey=PAKZAKJEQWGGBZ-UHFFFAOYSA-N
Data: 1 IC50
Activity Spreadsheet -- Enzyme Inhibition Constant Data from BindingDB
Found 1 hit for monomerid = 50304302
Trg + Lig
Ki
nM
ΔG°
kcal/mole
IC50
nM
Kd
nM
EC50/IC50
nM
koff
s-1
kon
M-1s-1
pHTemp
°C
NPY5R
(Rat 6B)
BDBM50304302
(3'-oxo-N-(5-phenylpyrazin-2-yl)-3'H-spiro[cyclohex...)
Show InChI InChI=1S/C24H21N3O3/c28-22(27-21-15-25-20(14-26-21)16-6-2-1-3-7-16)17-10-12-24(13-11-17)19-9-5-4-8-18(19)23(29)30-24/h1-9,14-15,17H,10-13H2,(H,26,27,28)
n/an/a 2.5n/an/an/an/an/an/a
Tsukuba Research Institute
Curated by ChEMBL
Assay Description
Inhibition of rat Y5 receptor
Bioorg Med Chem 17: 6971-82 (2009)
Article DOI: 10.1016/j.bmc.2009.08.019
BindingDB Entry DOI: 10.7270/Q2P26Z62