BDBM50304308 CHEMBL596266::trans-3-Oxo-N-(3-phenyl-1H-pyrazol-5-yl)-3H-spiro[5-aza-2-benzofuran-1,1'-cyclohexane]-4'-carboxamide
SMILES: O=C(Nc1cc(n[nH]1)-c1ccccc1)[C@H]1CC[C@@]2(CC1)OC(=O)c1cnccc21
InChI Key: InChIKey=KXLDSWYFKKSLKO-VVONHTQRSA-N
Data: 1 IC50
Activity Spreadsheet -- Enzyme Inhibition Constant Data from BindingDB
Found 1 hit for monomerid = 50304308
Trg + Lig
Ki
nM
ΔG°
kcal/mole
IC50
nM
Kd
nM
EC50/IC50
nM
koff
s-1
kon
M-1s-1
pHTemp
°C
Neuropeptide Y receptor type 5 ( NPY Y5)
(Homo sapiens (Human))
BDBM50304308
(CHEMBL596266 | trans-3-Oxo-N-(3-phenyl-1H-pyrazol-...)
Show SMILES O=C(Nc1cc(n[nH]1)-c1ccccc1)[C@H]1CC[C@@]2(CC1)OC(=O)c1cnccc21 |r,wU:17.22,wD:14.15,(-3.34,-34.45,;-2.57,-35.79,;-1.03,-35.79,;-.2,-37.09,;-.75,-38.53,;.44,-39.5,;1.74,-38.66,;1.34,-37.17,;.36,-41.03,;-1.01,-41.72,;-1.1,-43.26,;.19,-44.1,;1.57,-43.4,;1.65,-41.87,;-3.34,-37.12,;-4.88,-37.12,;-5.66,-38.46,;-4.88,-39.78,;-3.34,-39.78,;-2.58,-38.46,;-3.97,-41.04,;-4.88,-42.3,;-4.4,-43.76,;-6.35,-41.82,;-7.68,-42.59,;-9.02,-41.82,;-9.02,-40.27,;-7.69,-39.5,;-6.35,-40.27,)|
Show InChI InChI=1S/C22H20N4O3/c27-20(24-19-12-18(25-26-19)14-4-2-1-3-5-14)15-6-9-22(10-7-15)17-8-11-23-13-16(17)21(28)29-22/h1-5,8,11-13,15H,6-7,9-10H2,(H2,24,25,26,27)/t15-,22-
n/an/a 2.90n/an/an/an/an/an/a
Tsukuba Research Institute
Curated by ChEMBL
Assay Description
Displacement of [125I]PYY from human recombinant Y5 receptor
Bioorg Med Chem 17: 6971-82 (2009)
Article DOI: 10.1016/j.bmc.2009.08.019
BindingDB Entry DOI: 10.7270/Q2P26Z62